1,2,4-Cyclopentanetrione, 3-butyl-
- Formula: C9H12O3
- Molecular weight: 168.1898
- IUPAC Standard InChIKey: HMFXLRRRGHKBCH-UHFFFAOYSA-N
- CAS Registry Number: 46005-09-8
- Chemical structure:
View 3d structure (requires JavaScript / HTML 5) - Other names: 3-Butyl-1,2,4-cyclopentanetrione

Normal alkane RI, non-polar column, custom temperature program

Column type | Active phase | I | Reference | Comment |
---|---|---|---|---|
Capillary | HP-5 | 1486. | Zhao, Li, et al., 2008 | 30. m/0.25 mm/0.25 μm; Program: 40 0C (2 min) 5 0C/min -> 80 0C 7 oC/min -> 160 0C 9 0C/min -> 200 0C 20 0C/min -> 280 0C (10 min) |

References

Zhao, Li, et al., 2008
Zhao, Y.; Li, J.; Xu, Y.; Duan, H.; Fan, W.; Zhao, G.,
EXtraction, preparation and identification of volatile compounds in Changyu XO brandy,
Chinese J. Chromatogr., 2008, 26, 2, 212-222, https://doi.org/10.1016/S1872-2059(08)60014-0
. [all data]