Geranic acid
- Formula: C10H16O2
- Molecular weight: 168.2328
- IUPAC Standard InChIKey: ZHYZQXUYZJNEHD-VQHVLOKHSA-N
- CAS Registry Number: 459-80-3
- Chemical structure:
View 3d structure (requires JavaScript / HTML 5) - Species with the same structure:
- Stereoisomers:
- Other names: 2,6-Octadienoic acid, 3,7-dimethyl-; 3,7-Dimethyl-2,6-octadienoic acid; 3,7-Dimethylocta-2,6-dienoic acid; (2E)-3,7-Dimethyl-2,6-octadienoic acid

Van Den Dool and Kratz RI, non-polar column, custom temperature program

Column type | Active phase | I | Reference | Comment |
---|---|---|---|---|
Capillary | HP-5MS | 1355.4 | Andriamaharavo, 2014 | 30. m/0.25 mm/0.25 μm, He; Program: 60C (1 min) => 5 C/min => 210C => 10 C/min => 280C (15 min) |

Normal alkane RI, non-polar column, temperature ramp

Column type | Active phase | I | Reference | Comment |
---|---|---|---|---|
Capillary | BP-1 | 1343. | Ottavioli, Bighelli, et al., 2009 | 50. m/0.22 mm/0.25 μm, Helium, 2. K/min, 220. C @ 20. min; Tstart: 60. C |

Normal alkane RI, polar column, temperature ramp

Column type | Active phase | I | Reference | Comment |
---|---|---|---|---|
Capillary | VF-Wax MS | 2347. | Duarte, Dias, et al., 2010 | 60. m/0.25 mm/0.25 μm, Helium, 60. C @ 5. min, 3. K/min, 220. C @ 25. min |
Capillary | BP-20 | 2356. | Ottavioli, Bighelli, et al., 2009 | 50. m/0.22 mm/0.25 μm, Helium, 2. K/min, 220. C @ 20. min; Tstart: 60. C |

Normal alkane RI, polar column, custom temperature program

Column type | Active phase | I | Reference | Comment |
---|---|---|---|---|
Capillary | CP-Wax 52 CB | 2347. | Genisheva and Oliveira, 2009 | 50. m/0.25 mm/0.20 μm, Helium; Program: 60 0C (5 min) 3 0C/min -> 250 0C (20 min) 1 0C/min -> 255 0C |

References

Andriamaharavo, 2014
Andriamaharavo, N.R.,
Retention Data. NIST Mass Spectrometry Data Center., NIST Mass Spectrometry Data Center, 2014. [all data]
Ottavioli, Bighelli, et al., 2009
Ottavioli, J.; Bighelli, A.; Casanova, J.; Bang, B.T.; Y.,
GC (retention indices), GC-MS, and 13C NMR of two citral-rich Cymbopogon leaf oils: C. Flexuosus and C. tortilis,
Spectroscopy Lett., 2009, 42, 8, 506-512, https://doi.org/10.1080/00387010903022350
. [all data]
Duarte, Dias, et al., 2010
Duarte, W.F.; Dias, D.R.; Oliveira, J.M.; Teixeira, J.A.; de Almeida e Silva, J.B.; Schwan, R.F.,
Characterization of different fruit wines made from cacao,cupuassu, gabiroba, jaboticaba and umbu,
Food Sci. Technol., 2010, 43, 1564-1572. [all data]
Genisheva and Oliveira, 2009
Genisheva, Z.; Oliveira, J.M.,
Monoterpenic characterization of white cultivars from Vinhos Verdes appelation of origin (North Portugal),
J. Inst. Brewing, 2009, 115, 4, 308-317, https://doi.org/10.1002/j.2050-0416.2009.tb00386.x
. [all data]