Acetic acid, fluoro-, ethyl ester
- Formula: C4H7FO2
- Molecular weight: 106.0956
- IUPAC Standard InChIKey: VCYZVXRKYPKDQB-UHFFFAOYSA-N
- CAS Registry Number: 459-72-3
- Chemical structure:
View 3d structure (requires JavaScript / HTML 5) - Other names: Ethyl fluoroacetate; Ethyl monofluoroacetate; Fluoracetic acid ethyl ester; Ethylester kyseliny fluoroctove

Condensed phase thermochemistry data

Data compiled by: Hussein Y. Afeefy, Joel F. Liebman, and Stephen E. Stein
Quantity | Value | Units | Method | Reference | Comment |
---|---|---|---|---|---|
ΔcH°liquid | -2105. | kJ/mol | Ccb | Swarts, 1919 | Not corrected for CODATA value of ΔfH |

Phase change data

Data compiled as indicated in comments:
BS - Robert L. Brown and Stephen E. Stein
AC - William E. Acree, Jr., James S. Chickos
Reduced pressure boiling point
Tboil (K) | Pressure (bar) | Reference | Comment |
---|---|---|---|
392.5 | 1.00 | Weast and Grasselli, 1989 | BS |
Enthalpy of vaporization
ΔvapH (kJ/mol) | Temperature (K) | Method | Reference | Comment |
---|---|---|---|---|
41.9 | 288. | A,GS | Stephenson and Malanowski, 1987 | Based on data from 273. to 333. K. See also Redemann, Chaikin, et al., 1948 and Dykyj, 1971.; AC |

References

Swarts, 1919
Swarts, F.,
Etudes thermochimiques sur les combinaisons organiques fluorees,
J. Chim. Phys., 1919, 17, 3-70. [all data]
Weast and Grasselli, 1989
CRC Handbook of Data on Organic Compounds, 2nd Editon, Weast,R.C and Grasselli, J.G., ed(s)., CRC Press, Inc., Boca Raton, FL, 1989, 1. [all data]
Stephenson and Malanowski, 1987
Stephenson, Richard M.; Malanowski, Stanislaw,
Handbook of the Thermodynamics of Organic Compounds, 1987, https://doi.org/10.1007/978-94-009-3173-2
. [all data]
Redemann, Chaikin, et al., 1948
Redemann, C. Ernst; Chaikin, Saul W.; Fearing, Ralph B.; Rotariu, George J.; Savit, Joseph; Hoesen, Drusilla van,
The Vapor Pressures of Forty-one Fluorine-containing Organic Compounds 1,
J. Am. Chem. Soc., 1948, 70, 11, 3604-3606, https://doi.org/10.1021/ja01191a017
. [all data]
Dykyj, 1971
Dykyj, J.,
Petrochemia, 1971, 11, 2, 27. [all data]