4-Fluorobenzyl alcohol

Phase change data

Data compiled by: Robert L. Brown and Stephen E. Stein

Reduced pressure boiling point

Tboil (K) Pressure (atm) Reference
482.0.961PCR Inc., 1990

Reaction thermochemistry data

Data compiled by: John E. Bartmess

Individual Reactions

C7H6FO- + Hydrogen cation = 4-Fluorobenzyl alcohol

By formula: C7H6FO- + H+ = C7H7FO

Quantity Value Units Method Reference Comment
Δr366.0 ± 2.1kcal/molG+TSMustanir, Than, et al., 2005gas phase
Quantity Value Units Method Reference Comment
Δr359.4 ± 2.0kcal/molIMREMustanir, Than, et al., 2005gas phase

Gas phase ion energetics data

Data compiled by: John E. Bartmess

De-protonation reactions

C7H6FO- + Hydrogen cation = 4-Fluorobenzyl alcohol

By formula: C7H6FO- + H+ = C7H7FO

Quantity Value Units Method Reference Comment
Δr366.0 ± 2.1kcal/molG+TSMustanir, Than, et al., 2005gas phase
Quantity Value Units Method Reference Comment
Δr359.4 ± 2.0kcal/molIMREMustanir, Than, et al., 2005gas phase

References

PCR Inc., 1990
PCR Inc., Research Chemicals Catalog 1990-1991, PCR Inc., Gainesville, FL, 1990, 1. [all data]

Mustanir, Than, et al., 2005
Mustanir; Than, S.; Mishima, M., Substituent effects on the gas phase acidity of phenylacetylenes and benzyl alcohols, Bull. Chem. Soc. Japan, 2005, 78, 1, 147-153, https://doi.org/10.1246/bcsj.78.147 . [all data]