Me-triCl-p-benzoquinone radical
- Formula: C7H3Cl3O2
- Molecular weight: 225.457
- IUPAC Standard InChIKey: ZBWPOKNIKGLQBA-UHFFFAOYSA-N
- CAS Registry Number: 4592-97-6
- Chemical structure:
View 3d structure (requires JavaScript / HTML 5) - Permanent link for this species. Use this link for bookmarking this species for future reference.

Gas phase ion energetics data

Data compiled by: John E. Bartmess
Electron affinity determinations
EA (eV) | Method | Reference | Comment |
---|---|---|---|
2.545 ± 0.048 | IMRE | Fukuda and McIver, 1985 | ΔGea(355 K) = -57.5 kcal/mol; ΔSea =-3.5, est. from data in Heinis, Chowdhury, et al., 1988 |

References

Fukuda and McIver, 1985
Fukuda, E.K.; McIver, R.T., Jr.,
Relative electron affinities of substituted benzophenones, nitrobenzenes, and quinones. [Anchored to EA(SO2) from 74CEL/BEN],
J. Am. Chem. Soc., 1985, 107, 2291. [all data]
Heinis, Chowdhury, et al., 1988
Heinis, T.; Chowdhury, S.; Scott, S.L.; Kebarle, P.,
Electron Affinities of Benzo-, Naphtho-, and Anthraquinones Determined from Gas-Phase Equilibria Measurements,
J. Am. Chem. Soc., 1988, 110, 2, 400, https://doi.org/10.1021/ja00210a015
. [all data]