Benzene, 1-ethoxy-4-fluoro-
- Formula: C8H9FO
- Molecular weight: 140.1549
- IUPAC Standard InChIKey: PURLWQWDGIIYBG-UHFFFAOYSA-N
- CAS Registry Number: 459-26-7
- Chemical structure:
View 3d structure (requires JavaScript / HTML 5) - Other names: Phenetole, p-fluoro-; p-Fluorophenetole; 4-Fluorophenetole

Condensed phase thermochemistry data

Data compiled by: Hussein Y. Afeefy, Joel F. Liebman, and Stephen E. Stein
Quantity | Value | Units | Method | Reference | Comment |
---|---|---|---|---|---|
ΔcH°liquid | -4282.95 | kJ/mol | Ccb | Swarts, 1919 | Not corrected for CODATA value of ΔfH |

References

Swarts, 1919
Swarts, F.,
Etudes thermochimiques sur les combinaisons organiques fluorees,
J. Chim. Phys., 1919, 17, 3-70. [all data]