Benzene, (2-fluoroethyl)-
- Formula: C8H9F
- Molecular weight: 124.1555
- IUPAC Standard InChIKey: VEEYKGRLIXCNCZ-UHFFFAOYSA-N
- CAS Registry Number: 458-87-7
- Chemical structure:
View 3d structure (requires JavaScript / HTML 5) - Permanent link for this species. Use this link for bookmarking this species for future reference.

Normal alkane RI, non-polar column, temperature ramp

Column type | Active phase | I | Reference | Comment |
---|---|---|---|---|
Capillary | OV-101 | 924. | Zenkevich, Eliseenkov, et al., 2006 | Nitrogen, 6. K/min, 240. C @ 10. min; Column length: 25. m; Column diameter: 0.20 mm; Tstart: 60. C |
Capillary | OV-101 | 924. | Zenkevich, Makarov, et al., 2005 | 25. m/0.25 mm/0.20 μm, Nitrogen, 60. C @ 0. min, 8. K/min, 240. C @ 0. min |

References

Zenkevich, Eliseenkov, et al., 2006
Zenkevich, I.G.; Eliseenkov, E.V.; Kasatochkin, A.N.,
Application of Retention Indices in GC-MS Identification of Halogenated Organic Compounds,
Mass Spectromery (Rus.), 2006, 3, 2, 131-140. [all data]
Zenkevich, Makarov, et al., 2005
Zenkevich, I.G.; Makarov, A.A.; Eliseenkov, E.V.,
The XXIX Symposium Chromatographic Methods of Investigating the Organic Compounds. Book of Abstracts, Retention indices of some fluorinated arenes C7-C9 on polar inorganic sorbents. Unusual behavior of Silipor 600, Institute of Chemistry, Silesian University, Katowice, Poland, 2005, 43. [all data]