1-Octene, 2-methyl-
- Formula: C9H18
- Molecular weight: 126.2392
- IUPAC Standard InChIKey: FBEDQPGLIKZGIN-UHFFFAOYSA-N
- CAS Registry Number: 4588-18-5
- Chemical structure:
View 3d structure (requires JavaScript / HTML 5) - Other names: 2-Methyl-1-octene; 2-Methyloct-1-ene

Phase change data

Data compiled by: Thermodynamics Research Center, NIST Boulder Laboratories, Chris Muzny director
Quantity | Value | Units | Method | Reference | Comment |
---|---|---|---|---|---|
Tboil | 417. ± 2. | K | AVG | N/A | Average of 6 values; Individual data points |
Quantity | Value | Units | Method | Reference | Comment |
Tfus | 195.29 | K | N/A | Mears, Fookson, et al., 1950 | Uncertainty assigned by TRC = 0.2 K |

Kovats' RI, non-polar column, isothermal

Column type | Active phase | Temperature (C) | I | Reference | Comment |
---|---|---|---|---|---|
Capillary | OV-101 | 40. | 880. | Laub and Purnell, 1988 | |
Capillary | OV-101 | 60. | 881. | Laub and Purnell, 1988 | |
Capillary | OV-101 | 80. | 882. | Laub and Purnell, 1988 | |
Capillary | Squalane | 100. | 874. | Lulova, Leont'eva, et al., 1976 | He; Column length: 120. m; Column diameter: 0.25 mm |
Capillary | Squalane | 55. | 874. | Lulova, Leont'eva, et al., 1975 | He; Column length: 120. m; Column diameter: 0.25 mm |
Capillary | Squalane | 100. | 868. | Mitra, Mohan, et al., 1974 | H2; Column length: 50. m; Column diameter: 0.2 mm |
Capillary | Squalane | 80. | 874. | Schomburg, 1967 | Ar; Column length: 100. m |

Kovats' RI, non-polar column, custom temperature program

Column type | Active phase | I | Reference | Comment |
---|---|---|---|---|
Capillary | Petrocol DH-100 | 860. | Haagen-Smit Laboratory, 1997 | He; Column length: 100. m; Column diameter: 0.2 mm; Program: 5C(10min) => 5C/min => 50C(48min) => 1.5C/min => 195C(91min) |

Van Den Dool and Kratz RI, non-polar column, temperature ramp

Column type | Active phase | I | Reference | Comment |
---|---|---|---|---|
Capillary | Petrocol DH | 881. | White, Hackett, et al., 1992 | 100. m/0.25 mm/0.5 μm, He, 1. K/min; Tstart: 30. C; Tend: 220. C |

Van Den Dool and Kratz RI, non-polar column, custom temperature program

Column type | Active phase | I | Reference | Comment |
---|---|---|---|---|
Capillary | DB-5 | 883. | Zaikin and Borisov, 2002 | He; Column length: 30. m; Column diameter: 0.25 mm; Program: 30C => 5K/min=120C => 10C/min => 270C |

Normal alkane RI, non-polar column, isothermal

Column type | Active phase | Temperature (C) | I | Reference | Comment |
---|---|---|---|---|---|
Capillary | Squalane | 70. | 874. | Schomburg, 1966 |

Normal alkane RI, non-polar column, temperature ramp

Column type | Active phase | I | Reference | Comment |
---|---|---|---|---|
Capillary | Polydimethyl siloxane: CP-Sil 5 CB | 858. | Bramston-Cook, 2013 | 60. m/0.25 mm/1.0 μm, Helium, 45. C @ 1.45 min, 3.6 K/min, 210. C @ 2.72 min |
Capillary | PONA | 876. | Zhang, Ding, et al., 2009 | 50. m/0.20 mm/0.50 μm, Nitrogen, 35. C @ 15. min, 2. K/min, 200. C @ 10. min |
Capillary | OV-101 | 880. | Orav, Kailas, et al., 1999 | 50. m/0.20 mm/0.50 μm, Helium, 30. C @ 6. min, 1. K/min; Tend: 100. C |

Normal alkane RI, non-polar column, custom temperature program

Column type | Active phase | I | Reference | Comment |
---|---|---|---|---|
Capillary | DB-1 | 898. | Ciccioli, Cecinato, et al., 1994 | 60. m/0.32 mm/0.25 μm; Program: not specified |

References

Mears, Fookson, et al., 1950
Mears, T.W.; Fookson, A.; Pomerantz, P.; Rich, E.H.; Dussinger, C.S.; Howard, F.L.,
Syntheses and Properties of Two Olefins, Six Paraffins, and Their Intermediates,
J. Res. Natl. Bur. Stand. (U. S.), 1950, 44, 299. [all data]
Laub and Purnell, 1988
Laub, R.J.; Purnell, J.H.,
Specific retention volumes, retention indices, and family-plot regressions of aliphatic, alicyclic, and aromatic hydrocarbon solutes with OV-101 poly (dimethylsiloxane) stationary phase,
J. Hi. Res. Chromatogr. Chromatogr. Comm., 1988, 11, 9, 649-660, https://doi.org/10.1002/jhrc.1240110908
. [all data]
Lulova, Leont'eva, et al., 1976
Lulova, N.I.; Leont'eva, S.A.; Timofeeva, A.N.,
Gas-chromatographic method of determination of individual hydrocarbons in catalytic cracking gasolines
in Proceedings of All-Union Research Institute on Oil Processes. Vol.18, All-Union Research Institute on Oil Processes, Moscow, 1976, 30-53. [all data]
Lulova, Leont'eva, et al., 1975
Lulova, N.I.; Leont'eva, S.A.; Fedosova, A.K.; Kvasova, V.A.,
Individual composition of hydrocarbons in naphthas from secondary processes,
Chem. Technol. Fuels Oils (Engl. Transl.), 1975, 11, 1/2, 59-64, https://doi.org/10.1007/BF00717315
. [all data]
Mitra, Mohan, et al., 1974
Mitra, G.D.; Mohan, G.; Sinha, A.,
Gas chromatographic analysis of complex hydrocarbon mixtures,
J. Chromatogr. A, 1974, 91, 633-648, https://doi.org/10.1016/S0021-9673(01)97944-0
. [all data]
Schomburg, 1967
Schomburg, G.,
Struktur und Retentionsverhalten von Offenkettigen und Cyclischen Kohlenwasserstoffen und Deren Einfacher Substitutionsprodukte,
Anal. Chim. Acta., 1967, 38, 45-64, https://doi.org/10.1016/S0003-2670(01)80560-2
. [all data]
Haagen-Smit Laboratory, 1997
Haagen-Smit Laboratory,
Procedure for the detailed hydrocarbon analysis of gasolines by single column high efficiency (capillary) column gas chromatography, SOP NO. MLD 118, Revision No. 1.1, California Environmental Protection Agency, Air Resources Board, El Monte, California, 1997, 22. [all data]
White, Hackett, et al., 1992
White, C.M.; Hackett, J.; Anderson, R.R.; Kail, S.; Spock, P.S.,
Linear temperature programmed retention indices of gasoline range hydrocarbons and chlorinated hydrocarbons on cross-linked polydimethylsiloxane,
J. Hi. Res. Chromatogr., 1992, 15, 2, 105-120, https://doi.org/10.1002/jhrc.1240150211
. [all data]
Zaikin and Borisov, 2002
Zaikin, V.G.; Borisov, R.S.,
Chromatographic-mass spectrometric analysis of Fishcer-Tropsch synthesis products,
J. Anal. Chem. USSR (Engl. Transl.), 2002, 57, 6, 544-551. [all data]
Schomburg, 1966
Schomburg, G.,
Gaschromatographische Retentionsdaten und Struktur Chemischer Verbindungen. II. Methylverzweigungen und Doppelbindungen in Offenkettigen Kohlenwasserstoffen,
J. Chromatogr., 1966, 23, 1-17, https://doi.org/10.1016/S0021-9673(01)98652-2
. [all data]
Bramston-Cook, 2013
Bramston-Cook, R.,
Kovats indices for C2-C13 hydrocarbons and selected oxygenated/halocarbons with 100 % dimethylpolysiloxane columns, 2013, retrieved from http://lotusinstruments.com/monographs/List .... [all data]
Zhang, Ding, et al., 2009
Zhang, X.; Ding, L.; Sun, Z.; Song, L.; Sun, T.,
Study on quantitative structure-retention relationships for hydrocarbons in FCC gasoline,
Chromatographia, 2009, 70, 3/4, 511-518, https://doi.org/10.1365/s10337-009-1174-0
. [all data]
Orav, Kailas, et al., 1999
Orav, A.; Kailas, T.; Muurisepp, M.; Kann, J.,
Composition of the oil from waste tires. 1. Fraction boiling at yp to 160 0C,
Proc. Estonian Acad. Sci. Chem., 1999, 48, 1, 30-39. [all data]
Ciccioli, Cecinato, et al., 1994
Ciccioli, P.; Cecinato, A.; Brancaleoni, E.; Brachetti, A.; Frattoni, M.; Sparapani, R.,
Composition and Distribution of Polar and Non-Polar VOCs in Urban, Rural, Forest and Remote Areas,
Eur Commission EUR, 1994, 549-568. [all data]