4,8-Methanoazulen-9-ol, decahydro-2,2,4,8-tetramethyl-, stereoisomer
- Formula: C15H26O
- Molecular weight: 222.3663
- IUPAC Standard InChIKey: MJYUBUQHKCAJQR-UHFFFAOYSA-N
- CAS Registry Number: 4586-22-5
- Chemical structure:
View 3d structure (requires JavaScript / HTML 5) - Stereoisomers:
- Other names: 4,8-Methanoazulen-9-ol, 1,2,3,3aα,4,5,6,7,8,8aα-decahydro-2,2,4β,8β-tetramethyl-; α-Caryophyllene alcohol; 11-Apollanol; α-Caryophyllenol

Kovats' RI, non-polar column, temperature ramp

Column type | Active phase | I | Reference | Comment |
---|---|---|---|---|
Capillary | HP-5MS | 1568. | Roussis, Tsoukatou, et al., 2000 | 30. m/0.25 mm/0.25 μm, He, 3. K/min; Tstart: 60. C; Tend: 280. C |
Capillary | HP-5MS | 1563. | Siani, Ramos, et al., 1999 | 30. m/0.32 mm/0.25 μm, He, 70. C @ 5. min, 3. K/min; Tend: 250. C |

Normal alkane RI, non-polar column, custom temperature program

Column type | Active phase | I | Reference | Comment |
---|---|---|---|---|
Capillary | HP-5 MS | 1569. | Setzer, Stokes, et al., 2007 | Helium; Column length: 30. m; Column diameter: 0.25 mm; Program: 40 0C (10 min) 3 oC/min -> 200 0C 2 0C/min -> 220 0C |
Capillary | SE-30 | 1556. | Vinogradov, 2004 | Program: not specified |
Capillary | SE-54 | 1554. | Lima, Veiga, et al., 2003 | 25. m/0.25 mm/0.25 μm, H2; Program: 110C(2min) => 3C/min => 130C => 8.5C => 290C |
Capillary | Polydimethyl siloxanes | 1556. | Zenkevich, 1997 | Program: not specified |

References

Roussis, Tsoukatou, et al., 2000
Roussis, V.; Tsoukatou, M.; Petrakis, P.V.; Chinou, I.; Skoula, M.; Harborne, J.B.,
Volatile constituents of four Helichrysum species growing in Greece,
Biochem. Syst. Ecol., 2000, 28, 2, 163-175, https://doi.org/10.1016/S0305-1978(99)00046-0
. [all data]
Siani, Ramos, et al., 1999
Siani, A.C.; Ramos, M.F.S.; Menezes-de-Lima, O., Jr.; Ribeiro-dos-Santos, R.; Fernadez-Ferreira, E.; Soares, R.O.A.; Rosas, E.C.; Susunaga, G.S.; Guimarães, A.C.; Zoghbi, M.G.B.; Henriques, M.G.M.O.,
Evaluation of anti-inflammatory-related activity of essential oils from the leaves and resin of species of Protium,
J. Ethnopharmacol., 1999, 66, 1, 57-69, https://doi.org/10.1016/S0378-8741(98)00148-2
. [all data]
Setzer, Stokes, et al., 2007
Setzer, W.N.; Stokes, S.L.; Penton, A.F.; Takaku, S.; Haber, W.A.; Hansell, E.; Caffrey, C.R.; McKerrow, J.H.,
Cruzain inhibitory activity of leaf essential oils of neotropical Lauraceae and essential oil components,
Natural Product Communications, 2007, 2, 12, 1203-1210. [all data]
Vinogradov, 2004
Vinogradov, B.A.,
Production, composition, properties and application of essential oils, 2004, retrieved from http://viness.narod.ru. [all data]
Lima, Veiga, et al., 2003
Lima, S.R.M.; Veiga, V.F., Jr.; Christo, H.B.; Pinto, A.C.; Fernandes, P.D.,
In vivo and in vitro studies on the anticancer activity of Copaifera multijuga Hayne and its fractions,
Phytother. Res., 2003, 17, 9, 1048-1053, https://doi.org/10.1002/ptr.1295
. [all data]
Zenkevich, 1997
Zenkevich, I.G.,
Analytical Parameters of Components of Essential Oils for their Chromatographic and Chromato-Spectral Identificaiton. Oxsigenated derivatives of Mono- and Sesquiterpene Hydrocarbons,
Rastit, Resursy (Rus.), 1997, 33, 1, 16-28. [all data]