trans-3,6-Endomethylene-1,2,3,6-tetrahydrophthaloyl chloride
- Formula: C9H8Cl2O2
- Molecular weight: 219.065
- IUPAC Standard InChIKey: KANQIAARVSWKKG-UHFFFAOYSA-N
- CAS Registry Number: 4582-21-2
- Chemical structure:
View 3d structure (requires JavaScript / HTML 5) - Other names: Bicyclo[2.2.1]hept-5-ene-2,3-dicarbonyl dichloride, (2-endo,3-exo)-; trans-Bicyclo(2.2.1)hept-5-enyl-2,3-dicarbonylchloride; 5-Norbornene-2,3-dicarbonyl chloride, trans-; (2-endo,3-exo)-bicyclo[2.2.1]hept-5-ene-2,3-dicarbonyl dichloride

Van Den Dool and Kratz RI, non-polar column, custom temperature program

Column type | Active phase | I | Reference | Comment |
---|---|---|---|---|
Capillary | VF-5MS | 1385. | Tretyakov, 2011 | 30. m/0.25 mm/0.25 μm, He; Program: Multi-step temperature program; T(initial)=60C; T(final)=270C |

References

Tretyakov, 2011
Tretyakov, K.V.,
Retention Data. NIST Mass Spectrometry Data Center., NIST Mass Spectrometry Data Center, 2011. [all data]