Benzene, 1-ethoxy-3-fluoro-
- Formula: C8H9FO
- Molecular weight: 140.1549
- IUPAC Standard InChIKey: UWWCZZMOTBWUAB-UHFFFAOYSA-N
- CAS Registry Number: 458-03-7
- Chemical structure:
View 3d structure (requires JavaScript / HTML 5) - Other names: Phenetole, m-fluoro-

Condensed phase thermochemistry data

Data compiled by: Hussein Y. Afeefy, Joel F. Liebman, and Stephen E. Stein
Quantity | Value | Units | Method | Reference | Comment |
---|---|---|---|---|---|
ΔcH°liquid | -4269.4 | kJ/mol | Ccb | Swarts, 1919 | Not corrected for CODATA value of ΔfH |

Phase change data

Data compiled by: Robert L. Brown and Stephen E. Stein
Reduced pressure boiling point
Tboil (K) | Pressure (bar) | Reference |
---|---|---|
338.4 | 0.020 | Weast and Grasselli, 1989 |

References

Swarts, 1919
Swarts, F.,
Etudes thermochimiques sur les combinaisons organiques fluorees,
J. Chim. Phys., 1919, 17, 3-70. [all data]
Weast and Grasselli, 1989
CRC Handbook of Data on Organic Compounds, 2nd Editon, Weast,R.C and Grasselli, J.G., ed(s)., CRC Press, Inc., Boca Raton, FL, 1989, 1. [all data]