α,α,α-trifluoro-p-toluic acid
- Formula: C8H5F3O2
- Molecular weight: 190.1193
- IUPAC Standard InChIKey: SWKPKONEIZGROQ-UHFFFAOYSA-N
- CAS Registry Number: 455-24-3
- Chemical structure:
View 3d structure (requires JavaScript / HTML 5) - Other names: 4-Trifluoromethylbenzoic acid; p-Trifluoromethylbenzoic acid; Benzoic acid, 4-(trifluoromethyl)-

Reaction thermochemistry data

Data compiled by: John E. Bartmess
Individual Reactions
C8H4F3O2- + =
By formula: C8H4F3O2- + H+ = C8H5F3O2
Quantity | Value | Units | Method | Reference | Comment |
---|---|---|---|---|---|
ΔrH° | 1390. ± 8.8 | kJ/mol | G+TS | Taft and Topsom, 1987 | gas phase; value altered from reference due to change in acidity scale |
Quantity | Value | Units | Method | Reference | Comment |
ΔrG° | 1361. ± 8.4 | kJ/mol | IMRE | Taft and Topsom, 1987 | gas phase; value altered from reference due to change in acidity scale |

Gas phase ion energetics data

Data compiled by: John E. Bartmess
De-protonation reactions
C8H4F3O2- + =
By formula: C8H4F3O2- + H+ = C8H5F3O2
Quantity | Value | Units | Method | Reference | Comment |
---|---|---|---|---|---|
ΔrH° | 1390. ± 8.8 | kJ/mol | G+TS | Taft and Topsom, 1987 | gas phase; value altered from reference due to change in acidity scale |
Quantity | Value | Units | Method | Reference | Comment |
ΔrG° | 1361. ± 8.4 | kJ/mol | IMRE | Taft and Topsom, 1987 | gas phase; value altered from reference due to change in acidity scale |

References

Taft and Topsom, 1987
Taft, R.W.; Topsom, R.D.,
The Nature and Analysis of Substituent Effects,
Prog. Phys. Org. Chem., 1987, 16, 1. [all data]