Benzenamine, 4-(trifluoromethyl)-
- Formula: C7H6F3N
- Molecular weight: 161.1244
- IUPAC Standard InChIKey: ODGIMMLDVSWADK-UHFFFAOYSA-N
- CAS Registry Number: 455-14-1
- Chemical structure:
View 3d structure (requires JavaScript / HTML 5) - Other names: p-Aminobenzotrifluoride; 4-Aminobenzotrifluoride; 4-Amino-α,α,α-benzotrifluoride; p-Amino-α,α,α-trifluorotoluene; p-Toluidine, α,α,α-trifluoro-; p-(Trifluoromethyl)aniline; 4-(Trifluoromethyl)aniline; 4-(Trifluoromethyl)benzenamine; α,α,α-Trifluoro-p-toluidine; α,α,α-Trifluoro-p-anisidine; Aniline, p-(trifluoromethyl)-; 4-Aminobenzotrifluororide; 1-Amino-4-(trifluoromethyl)benzene; NSC 10337

Phase change data

Data compiled by: Robert L. Brown and Stephen E. Stein
Reduced pressure boiling point
Tboil (K) | Pressure (bar) | Reference |
---|---|---|
356.2 | 0.016 | Aldrich Chemical Company Inc., 1990 |
390.6 | 0.080 | PCR Inc., 1990 |

Reaction thermochemistry data

Data compiled by: John E. Bartmess
Individual Reactions
C7H5F3N- + =
By formula: C7H5F3N- + H+ = C7H6F3N
Quantity | Value | Units | Method | Reference | Comment |
---|---|---|---|---|---|
ΔrH° | 1478. ± 8.8 | kJ/mol | G+TS | Bartmess, Scott, et al., 1979 | gas phase; value altered from reference due to change in acidity scale |
Quantity | Value | Units | Method | Reference | Comment |
ΔrG° | 1448. ± 8.4 | kJ/mol | IMRE | Bartmess, Scott, et al., 1979 | gas phase; value altered from reference due to change in acidity scale |

References

Aldrich Chemical Company Inc., 1990
Aldrich Chemical Company Inc.,
Catalog Handbook of Fine Chemicals, Aldrich Chemical Company, Inc., Milwaukee WI, 1990, 1. [all data]
PCR Inc., 1990
PCR Inc.,
Research Chemicals Catalog 1990-1991, PCR Inc., Gainesville, FL, 1990, 1. [all data]
Bartmess, Scott, et al., 1979
Bartmess, J.E.; Scott, J.A.; McIver, R.T., Jr.,
The gas phase acidity scale from methanol to phenol,
J. Am. Chem. Soc., 1979, 101, 6047. [all data]