cis-Cycloheptene
- Formula: C7H12
- Molecular weight: 96.1702
- IUPAC Standard InChIKey: ZXIJMRYMVAMXQP-UHFFFAOYSA-N
- CAS Registry Number: 45509-99-7
- Chemical structure:
View 3d structure (requires JavaScript / HTML 5) - Species with the same structure:

Condensed phase thermochemistry data

Data compiled by: Eugene S. Domalski and Elizabeth D. Hearing
Quantity | Value | Units | Method | Reference | Comment |
---|---|---|---|---|---|
S°liquid | 241.0 | J/mol*K | N/A | Lebedev and Smirnova, 1989 |
Constant pressure heat capacity of liquid
Cp,liquid (J/mol*K) | Temperature (K) | Reference | Comment |
---|---|---|---|
171.7 | 298.15 | Lebedev and Smirnova, 1989 | T = 0 to 310 K. |

Phase change data

Data compiled by: Eugene S. Domalski and Elizabeth D. Hearing
Enthalpy of phase transition
ΔHtrs (kJ/mol) | Temperature (K) | Initial Phase | Final Phase | Reference | Comment |
---|---|---|---|---|---|
7.070 | 154.22 | crystaline, III | crystaline, II | Lebedev and Smirnova, 1989 | |
0.730 | 208.26 | crystaline, II | crystaline, I | Lebedev and Smirnova, 1989 | |
0.820 | 217.75 | crystaline, I | liquid | Lebedev and Smirnova, 1989 |
Entropy of phase transition
ΔStrs (J/mol*K) | Temperature (K) | Initial Phase | Final Phase | Reference | Comment |
---|---|---|---|---|---|
45.8 | 154.22 | crystaline, III | crystaline, II | Lebedev and Smirnova, 1989 | |
3.5 | 208.26 | crystaline, II | crystaline, I | Lebedev and Smirnova, 1989 | |
4.1 | 217.75 | crystaline, I | liquid | Lebedev and Smirnova, 1989 |

References

Lebedev and Smirnova, 1989
Lebedev, B.V.; Smirnova, N.N.,
Thermodynamics of cis-cycloheptene at 0-310 K,
Zhur. Fiz. Khim., 1989, 63, 1444-1450. [all data]