3-(Trifluoromethyl)benzoic acid
- Formula: C8H5F3O2
- Molecular weight: 190.1193
- IUPAC Standard InChIKey: FQXQBFUUVCDIRK-UHFFFAOYSA-N
- CAS Registry Number: 454-92-2
- Chemical structure:
View 3d structure (requires JavaScript / HTML 5) - Other names: α,α,α-Trifluoro-m-toluic acid; m-Trifluoromethylbenzoic acid; Benzoic acid, 3-(trifluoromethyl)-; m-Toluic acid, α,α,α-trifluoro-; Benzoic acid, trifluoromethyl-; m-Trifluorometylbenzoic acid

Reaction thermochemistry data

Data compiled by: John E. Bartmess
Individual Reactions
C8H4F3O2- + =
By formula: C8H4F3O2- + H+ = C8H5F3O2
Quantity | Value | Units | Method | Reference | Comment |
---|---|---|---|---|---|
ΔrH° | 1390. ± 8.8 | kJ/mol | G+TS | Taft, 1987 | gas phase; value altered from reference due to change in acidity scale |
Quantity | Value | Units | Method | Reference | Comment |
ΔrG° | 1361. ± 8.4 | kJ/mol | IMRE | Taft, 1987 | gas phase; value altered from reference due to change in acidity scale |

Condensed phase thermochemistry data

Data compiled as indicated in comments:
ALS - Hussein Y. Afeefy, Joel F. Liebman, and Stephen E. Stein
DH - Eugene S. Domalski and Elizabeth D. Hearing
Quantity | Value | Units | Method | Reference | Comment |
---|---|---|---|---|---|
ΔfH°solid | -255.66 ± 0.28 | kcal/mol | Ccr | Good, Lacina, et al., 1962 | Corrected for CODATA value of ΔfH; ALS |
Quantity | Value | Units | Method | Reference | Comment |
ΔcH°solid | -795.85 ± 0.14 | kcal/mol | Ccr | Good, Lacina, et al., 1962 | Corrected for CODATA value of ΔfH; ALS |
ΔcH°solid | -807.1 | kcal/mol | Ccb | Swarts, 1919 | Not corrected for CODATA value of ΔfH; ALS |
Constant pressure heat capacity of solid
Cp,solid (cal/mol*K) | Temperature (K) | Reference | Comment |
---|---|---|---|
53.44 | 298.15 | Good, Lacina, et al., 1962 | DH |

Phase change data

Data compiled as indicated in comments:
BS - Robert L. Brown and Stephen E. Stein
TRC - Thermodynamics Research Center, NIST Boulder Laboratories, Chris Muzny director
Quantity | Value | Units | Method | Reference | Comment |
---|---|---|---|---|---|
Tfus | 375. | K | N/A | Simons and Ramler, 1943 | Uncertainty assigned by TRC = 5. K; TRC |
Reduced pressure boiling point
Tboil (K) | Pressure (atm) | Reference | Comment |
---|---|---|---|
511.7 | 1.02 | Aldrich Chemical Company Inc., 1990 | BS |
511.6 | 1.02 | PCR Inc., 1990 | BS |

Gas phase ion energetics data

Data compiled by: John E. Bartmess
De-protonation reactions
C8H4F3O2- + =
By formula: C8H4F3O2- + H+ = C8H5F3O2
Quantity | Value | Units | Method | Reference | Comment |
---|---|---|---|---|---|
ΔrH° | 332.2 ± 2.1 | kcal/mol | G+TS | Taft, 1987 | gas phase; value altered from reference due to change in acidity scale |
Quantity | Value | Units | Method | Reference | Comment |
ΔrG° | 325.2 ± 2.0 | kcal/mol | IMRE | Taft, 1987 | gas phase; value altered from reference due to change in acidity scale |

References

Taft, 1987
Taft, R.W.,
The Nature and Analysis of Substitutent Electronic Effects,
Personal communication. See also Prog. Phys. Org. Chem., 1987, 16, 1. [all data]