Benzaldehyde, 3-(trifluoromethyl)-
- Formula: C8H5F3O
- Molecular weight: 174.1199
- IUPAC Standard InChIKey: NMTUHPSKJJYGML-UHFFFAOYSA-N
- CAS Registry Number: 454-89-7
- Chemical structure:
View 3d structure (requires JavaScript / HTML 5) - Other names: 3-Trifluoromethylbenzaldehyde; m-Trifluoromethylbenzaldehyde; α α α-Trifluoro-m-tolualdehyde; m-Tolualdehyde, α,α,α-trifluoro-; α,α,α-trifluoro-3-tolualdehyde

Phase change data

Data compiled by: Robert L. Brown and Stephen E. Stein
Reduced pressure boiling point
Tboil (K) | Pressure (bar) | Reference |
---|---|---|
357.7 | 0.040 | Aldrich Chemical Company Inc., 1990 |
356. to 359. | 0.040 | PCR Inc., 1990 |

Gas phase ion energetics data

Data compiled by: John E. Bartmess
Electron affinity determinations
EA (eV) | Method | Reference | Comment |
---|---|---|---|
0.815 ± 0.087 | IMRE | Mishima, Huh, et al., 1993 | ΔGea(343 K)=-19.4 kcal/mol. Reanchored to EA(PhNO2), Kebarle and Chowdhury, 1987. |
0.833 ± 0.087 | IMRE | Huh, Kang, et al., 1999 | ΔG(EA) 343K; anchored to ΔG value. Including anchor ΔS, EA is ca. 0.4 kcal/mol more bound. |

References

Aldrich Chemical Company Inc., 1990
Aldrich Chemical Company Inc.,
Catalog Handbook of Fine Chemicals, Aldrich Chemical Company, Inc., Milwaukee WI, 1990, 1. [all data]
PCR Inc., 1990
PCR Inc.,
Research Chemicals Catalog 1990-1991, PCR Inc., Gainesville, FL, 1990, 1. [all data]
Mishima, Huh, et al., 1993
Mishima, M.; Huh, C.; Nakamura, H.; Fujio, M.; Tsuno, Y.,
Electron Affinities of Benzaldehydes. Substituent Effects on Stabilities of Aromatic Radical Anions.,
Tetrahed. Lett., 1993, 34, 26, 4223, https://doi.org/10.1016/S0040-4039(00)60533-6
. [all data]
Kebarle and Chowdhury, 1987
Kebarle, P.; Chowdhury, S.,
Electron affinities and electron transfer reactions,
Chem. Rev., 1987, 87, 513. [all data]
Huh, Kang, et al., 1999
Huh, C.; Kang, C.H.; Lee, H.W.; Nakamura, H.; Mishima, M.; Tsuno, Y.; Yamataka, H.,
Thermodynamic stabilities and resonance demand of aromatic radical anions in the gas phase,
Bull. Chem. Soc. Japan, 1999, 72, 5, 1083-1091, https://doi.org/10.1246/bcsj.72.1083
. [all data]