pyrrolidine, N,3-dimethyl-
- Formula: C6H13N
- Molecular weight: 99.1741
- IUPAC Standard InChIKey: IGNGFGXAWDQJGP-UHFFFAOYSA-N
- CAS Registry Number: 45470-22-2
- Chemical structure:
View 3d structure (requires JavaScript / HTML 5) - Species with the same structure:

Phase change data

Data compiled by: Thermodynamics Research Center, NIST Boulder Laboratories, Chris Muzny director
Quantity | Value | Units | Method | Reference | Comment |
---|---|---|---|---|---|
Tboil | 382.15 | K | N/A | Loffler, 1910 | Uncertainty assigned by TRC = 3. K |

References

Loffler, 1910
Loffler, K.,
A New Synthesis of N-Alkyl Pyrrolidines,
Chem. Ber., 1910, 43, 2035. [all data]