Acetic acid, difluoro-, ethyl ester
- Formula: C4H6F2O2
- Molecular weight: 124.0860
- IUPAC Standard InChIKey: GZKHDVAKKLTJPO-UHFFFAOYSA-N
- CAS Registry Number: 454-31-9
- Chemical structure:
View 3d structure (requires JavaScript / HTML 5) - Other names: Ethyl difluoroacetate

Condensed phase thermochemistry data

Data compiled by: Hussein Y. Afeefy, Joel F. Liebman, and Stephen E. Stein
Quantity | Value | Units | Method | Reference | Comment |
---|---|---|---|---|---|
ΔcH°liquid | -1939.1 | kJ/mol | Ccb | Swarts, 1919 | Not corrected for CODATA value of ΔfH |

References

Swarts, 1919
Swarts, F.,
Etudes thermochimiques sur les combinaisons organiques fluorees,
J. Chim. Phys., 1919, 17, 3-70. [all data]