Benzene, (1-methylnonyl)-
- Formula: C16H26
- Molecular weight: 218.3776
- IUPAC Standard InChIKey: DDTJIQUCOLHYDL-UHFFFAOYSA-N
- CAS Registry Number: 4537-13-7
- Chemical structure:
View 3d structure (requires JavaScript / HTML 5) - Other names: Decane, 2-phenyl-; (2-Decyl)benzene; (1-Methylnonyl)benzene

Phase change data

Data compiled by: Thermodynamics Research Center, NIST Boulder Laboratories, Chris Muzny director
Quantity | Value | Units | Method | Reference | Comment |
---|---|---|---|---|---|
Tboil | 562.65 | K | N/A | Plaskunova, Shapovalova, et al., 1986 | Uncertainty assigned by TRC = 0.5 K |
Quantity | Value | Units | Method | Reference | Comment |
Tfus | 272.55 | K | N/A | Tilicheev, 1938 | Uncertainty assigned by TRC = 1. K |

Reaction thermochemistry data

Data compiled by: Hussein Y. Afeefy, Joel F. Liebman, and Stephen E. Stein
Individual Reactions
By formula: C16H26 = C16H26
Quantity | Value | Units | Method | Reference | Comment |
---|---|---|---|---|---|
ΔrH° | -0.23 ± 0.14 | kJ/mol | Eqk | Pimerzin, Nesterova, et al., 1986 | liquid phase; GLC |
ΔrH° | -0.23 ± 0.14 | kJ/mol | Eqk | Pimerzin, Nesterova, et al., 1985 | liquid phase; AlCl3 |

Kovats' RI, non-polar column, isothermal

Column type | Active phase | Temperature (C) | I | Reference | Comment |
---|---|---|---|---|---|
Capillary | OV-101 | 185. | 1595. | Lesko, Holotík, et al., 1976 | N2; Column length: 50. m; Column diameter: 0.25 mm |
Capillary | Apiezon | 200. | 1616. | Schomburg, 1966 |

Van Den Dool and Kratz RI, non-polar column, temperature ramp

Column type | Active phase | I | Reference | Comment |
---|---|---|---|---|
Capillary | DB-1 | 1588. | Peng, Hua, et al., 1992 | 30. m/0.32 mm/1.5 μm, 40. C @ 4. min, 8. K/min; Tend: 280. C |

Van Den Dool and Kratz RI, polar column, temperature ramp

Column type | Active phase | I | Reference | Comment |
---|---|---|---|---|
Capillary | DB-Wax | 1833. | Peng, Hua, et al., 1992 | 30. m/0.53 mm/1. μm, 40. C @ 4. min, 8. K/min, 200. C @ 20. min |

Normal alkane RI, non-polar column, custom temperature program

Column type | Active phase | I | Reference | Comment |
---|---|---|---|---|
Capillary | DB-1 | 1588. | Peng, 1996 | 30. m/0.53 mm/1.5 μm; Program: 40 0C (4 min) 8 0C/min -> 200 0C (1 min) 5 0C/min -> 280 0C (20 min) |

Normal alkane RI, polar column, custom temperature program

Column type | Active phase | I | Reference | Comment |
---|---|---|---|---|
Capillary | DB-Wax | 1833. | Peng, 1996 | 30. m/0.53 mm/1.0 μm; Program: 40 0C (4 min) 4 0C/min -> 200 0C (20 min) |

Lee's RI, non-polar column, custom temperature program

Column type | Active phase | I | Reference | Comment |
---|---|---|---|---|
Capillary | SE-54 | 273.1 | Peterman and Delfino, 1990 | 15. m/0.25 mm/0.25 μm, He; Program: 125 0C (15 min) 1 0C/min -> 131 0C 4 0C/min -> 247 0C 8 0C/min -> 280 0C (15 min) |

References

Plaskunova, Shapovalova, et al., 1986
Plaskunova, S.L.; Shapovalova, I.M.; Serebryakov, B.P.,
Azerb. Khim. Zh., 1986, No. 4, 96-9. [all data]
Tilicheev, 1938
Tilicheev, M.D.,
The critical solution temperatures in aniline of the aromatic hydrocarbons and paraffins of normal structure,
Khim. Tverd. Topl. (Leningrad), 1938, 9, 181-6. [all data]
Pimerzin, Nesterova, et al., 1986
Pimerzin, A.A.; Nesterova, T.N.; Rozhnov, A.M.,
Equilibria of isomeric transformations and relations between thermodynamic properties of secondary alkylbenzenes,
J. Chem. Thermodyn., 1986, 17, 641-648. [all data]
Pimerzin, Nesterova, et al., 1985
Pimerzin, a.A.; Nesterova, T.N.; Rozhnov, A.M.,
Equilibria of isomeric transformations and relations between thermodynamic properties of secondary alkylbenzenes,
J. Chem. Thermodyn., 1985, 17, 641-648. [all data]
Lesko, Holotík, et al., 1976
Lesko, J.; Holotík, S.; Krupcík, J.; Veselý, V.,
Gas Chromatographic and Mass Spectrometric Analysis of a Commercial Mixture of Phenylalkanes (Detergent Alkylates),
J. Chromatogr., 1976, 119, 293-306, https://doi.org/10.1016/S0021-9673(00)86793-X
. [all data]
Schomburg, 1966
Schomburg, G.,
Gaschromatographische Retentionsdaten und struktur chemischer verbindungen. III. Alkylverzweigte und ungesättigte cyclische Kohlenwasserstoffe,
J. Chromatogr., 1966, 23, 18-41, https://doi.org/10.1016/S0021-9673(01)98653-4
. [all data]
Peng, Hua, et al., 1992
Peng, C.T.; Hua, R.L.; Maltby, D.,
Prediction of retention indexes. IV. Chain branching in alkylbenzene isomers with C10-13 alkyl chains identified in a scintillator solvent,
J. Chromatogr., 1992, 589, 1-2, 231-239, https://doi.org/10.1016/0021-9673(92)80027-R
. [all data]
Peng, 1996
Peng, C.T.,
Gas chromatographic identification of aromatic hydrocarbons
in Liquid Scintillation Spectrometry, Cook, G.T.; Harkness, D.D.; MacKenzie, A.B.; Miller, B.F.; Scott, E.M., ed(s)., 1996, 221-232. [all data]
Peterman and Delfino, 1990
Peterman, P.H.; Delfino, J.J.,
Identification of isopropylbiphenyl, alkyl diphenylmethanes, diisopropylnaphthalene, linear alkyl benzenes and other polychlorinated biphenyl replacement compounds in effluents, sediments and fish in the Fox River system, Wisconsin,
Biomed. Environ. Mass Spectrom., 1990, 19, 12, 755-770, https://doi.org/10.1002/bms.1200191203
. [all data]