Benzene, (1-methyldodecyl)-
- Formula: C19H32
- Molecular weight: 260.4574
- IUPAC Standard InChIKey: FCXPVFLEDIQLLO-UHFFFAOYSA-N
- CAS Registry Number: 4534-53-6
- Chemical structure:
View 3d structure (requires JavaScript / HTML 5) - Other names: Tridecane, 2-phenyl-; 2-Phenyltridecane; (1-methyldodecyl)benzene

Kovats' RI, non-polar column, isothermal

Column type | Active phase | Temperature (C) | I | Reference | Comment |
---|---|---|---|---|---|
Capillary | OV-101 | 185. | 1906. | Lesko, Holotík, et al., 1976 | N2; Column length: 50. m; Column diameter: 0.25 mm |
Capillary | Apiezon | 200. | 1911. | Schomburg, 1966 |

Van Den Dool and Kratz RI, non-polar column, temperature ramp

Column type | Active phase | I | Reference | Comment |
---|---|---|---|---|
Capillary | DB-1 | 1894. | Peng, Hua, et al., 1992 | 30. m/0.32 mm/1.5 μm, 40. C @ 4. min, 8. K/min; Tend: 280. C |

Van Den Dool and Kratz RI, polar column, temperature ramp

Column type | Active phase | I | Reference | Comment |
---|---|---|---|---|
Capillary | Supelcowax-10 | 2164. | Chung, 1999 | 60. m/0.25 mm/0.25 μm, He, 35. C @ 5. min, 2. K/min, 195. C @ 90. min |
Capillary | DB-Wax | 2143. | Peng, Hua, et al., 1992 | 30. m/0.53 mm/1. μm, 40. C @ 4. min, 8. K/min, 200. C @ 20. min |

Normal alkane RI, non-polar column, custom temperature program

Column type | Active phase | I | Reference | Comment |
---|---|---|---|---|
Capillary | SLB-5 MS | 1916. | Mondello, 2012 | 30. m/0.25 mm/0.25 μm, Helium; Program: not specified |
Capillary | SLB-5 MS | 1922. | Mondello, 2012 | 30. m/0.25 mm/0.25 μm, Helium; Program: not specified |

References

Lesko, Holotík, et al., 1976
Lesko, J.; Holotík, S.; Krupcík, J.; Veselý, V.,
Gas Chromatographic and Mass Spectrometric Analysis of a Commercial Mixture of Phenylalkanes (Detergent Alkylates),
J. Chromatogr., 1976, 119, 293-306, https://doi.org/10.1016/S0021-9673(00)86793-X
. [all data]
Schomburg, 1966
Schomburg, G.,
Gaschromatographische Retentionsdaten und struktur chemischer verbindungen. III. Alkylverzweigte und ungesättigte cyclische Kohlenwasserstoffe,
J. Chromatogr., 1966, 23, 18-41, https://doi.org/10.1016/S0021-9673(01)98653-4
. [all data]
Peng, Hua, et al., 1992
Peng, C.T.; Hua, R.L.; Maltby, D.,
Prediction of retention indexes. IV. Chain branching in alkylbenzene isomers with C10-13 alkyl chains identified in a scintillator solvent,
J. Chromatogr., 1992, 589, 1-2, 231-239, https://doi.org/10.1016/0021-9673(92)80027-R
. [all data]
Chung, 1999
Chung, H.Y.,
Volatile components in crabmeats of Charybdis feriatus,
J. Agric. Food Chem., 1999, 47, 6, 2280-2287, https://doi.org/10.1021/jf981027t
. [all data]
Mondello, 2012
Mondello, L.,
HS-SPME-GCxGC-MS analysis of Yerba Mate (Ilex paraguariensis)
in Shimadzu GC-GC application compendium of comprehensive 2D GC, Vol. 1-5, Shimadzu Corp., 2012, 1-29. [all data]