2-Butenoic acid, 3-hydroxy-, methyl ester, (E)-
- Formula: C5H8O3
- Molecular weight: 116.1152
- IUPAC Standard InChIKey: DHVOJYDALVUWPZ-ARJAWSKDSA-N
- CAS Registry Number: 4525-24-0
- Chemical structure:
View 3d structure (requires JavaScript / HTML 5) - Permanent link for this species. Use this link for bookmarking this species for future reference.

Reaction thermochemistry data

Data compiled by: Hussein Y. Afeefy, Joel F. Liebman, and Stephen E. Stein
Individual Reactions
By formula: C5H8O3 = C5H8O3
Quantity | Value | Units | Method | Reference | Comment |
---|---|---|---|---|---|
ΔrH° | -12.7 ± 2.5 | kJ/mol | Eqk | Folkendt, Weiss-Lopez, et al., 1985 | gas phase; Gas phase NMR |

References

Folkendt, Weiss-Lopez, et al., 1985
Folkendt, M.M.; Weiss-Lopez, B.E.; Chauvel, J.P., Jr.; True, N.S.,
Gas-phase 1H NMR studies of keto-enol tautomerism of acetylacetone, methyl acetoacetate, and ethyl acetoacetate,
J. Phys. Chem., 1985, 89, 3347-3352. [all data]