Benzene, (1-methoxy-1-propenyl)-, (Z)-
- Formula: C10H12O
- Molecular weight: 148.2017
- IUPAC Standard InChIKey: QDKIWMYIJVIPNE-KMKOMSMNSA-N
- CAS Registry Number: 4518-65-4
- Chemical structure:
View 3d structure (requires JavaScript / HTML 5) - Stereoisomers:

Reaction thermochemistry data

Data compiled by: Hussein Y. Afeefy, Joel F. Liebman, and Stephen E. Stein
Individual Reactions
By formula: C10H12O = C10H12O
Quantity | Value | Units | Method | Reference | Comment |
---|---|---|---|---|---|
ΔrH° | -1.8 ± 0.8 | kJ/mol | Eqk | Taskinen and Mustonen, 1976 | liquid phase; solvent: Cyclohexane |

References

Taskinen and Mustonen, 1976
Taskinen, E.; Mustonen, E.,
Thermodynamics of vinyl ethers. XIV. Effect of aromatic and heteroaromatic α-substituents on the relative stabilities of geometric isomers,
Acta Chem. Scand., Ser. B, 1976, 30, 1-4. [all data]