Benzoic acid, 4-fluoro-, ethyl ester
- Formula: C9H9FO2
- Molecular weight: 168.1650
- IUPAC Standard InChIKey: UMPRJGKLMUDRHL-UHFFFAOYSA-N
- CAS Registry Number: 451-46-7
- Chemical structure:
View 3d structure (requires JavaScript / HTML 5) - Other names: Benzoic acid, p-fluoro-, ethyl ester; p-Fluorobenzoic acid, ethyl ester; Ethyl p-fluorobenzoate; Ethyl 4-fluorobenzoate; 4-Fluorobenzoic acid ethyl ester; Ethyl para-fluorobenzoate

Condensed phase thermochemistry data

Data compiled by: Hussein Y. Afeefy, Joel F. Liebman, and Stephen E. Stein
Quantity | Value | Units | Method | Reference | Comment |
---|---|---|---|---|---|
ΔcH°liquid | -4436.92 | kJ/mol | Ccb | Swarts, 1919 | Not corrected for CODATA value of ΔfH |

Phase change data

Data compiled by: Robert L. Brown and Stephen E. Stein
Quantity | Value | Units | Method | Reference | Comment |
---|---|---|---|---|---|
Tboil | 483.2 | K | N/A | Weast and Grasselli, 1989 |

References

Swarts, 1919
Swarts, F.,
Etudes thermochimiques sur les combinaisons organiques fluorees,
J. Chim. Phys., 1919, 17, 3-70. [all data]
Weast and Grasselli, 1989
CRC Handbook of Data on Organic Compounds, 2nd Editon, Weast,R.C and Grasselli, J.G., ed(s)., CRC Press, Inc., Boca Raton, FL, 1989, 1. [all data]