Ethanone, 1,2-diphenyl-
- Formula: C14H12O
- Molecular weight: 196.2445
- IUPAC Standard InChIKey: OTKCEEWUXHVZQI-UHFFFAOYSA-N
- CAS Registry Number: 451-40-1
- Chemical structure:
View 3d structure (requires JavaScript / HTML 5) - Other names: Acetophenone, 2-phenyl-; Benzoin, deoxy-; Benzyl phenyl ketone; Deoxybenzoin; Desoxybenzoin; Phenyl benzyl ketone; 1,2-Diphenylethanone; 2-Phenylacetophenone; 1,2-Diphenylethan-1-one

Condensed phase thermochemistry data

Data compiled by: Hussein Y. Afeefy, Joel F. Liebman, and Stephen E. Stein
Quantity | Value | Units | Method | Reference | Comment |
---|---|---|---|---|---|
ΔfH°solid | -71.09 | kJ/mol | Ccb | Parks and Mosher, 1962 | |
Quantity | Value | Units | Method | Reference | Comment |
ΔcH°solid | -7153. ± 3. | kJ/mol | Ccb | Parks and Mosher, 1962 | Corresponding ΔfHºsolid = -71.00 kJ/mol (simple calculation by NIST; no Washburn corrections) |

Phase change data

Data compiled as indicated in comments:
BS - Robert L. Brown and Stephen E. Stein
TRC - Thermodynamics Research Center, NIST Boulder Laboratories, Chris Muzny director
AC - William E. Acree, Jr., James S. Chickos
Quantity | Value | Units | Method | Reference | Comment |
---|---|---|---|---|---|
Tboil | 593.2 | K | N/A | Weast and Grasselli, 1989 | BS |
Quantity | Value | Units | Method | Reference | Comment |
Tfus | 329. | K | N/A | Roger and McGregor, 1934 | Uncertainty assigned by TRC = 3. K; TRC |
Tfus | 330. | K | N/A | Jenkins, 1933 | Uncertainty assigned by TRC = 4. K; TRC |
Enthalpy of vaporization
ΔvapH (kJ/mol) | Temperature (K) | Method | Reference | Comment |
---|---|---|---|---|
68.1 | 411. | A | Stephenson and Malanowski, 1987 | Based on data from 396. to 594. K. See also Stull, 1947.; AC |
Antoine Equation Parameters
log10(P) = A − (B / (T + C))
P = vapor pressure (bar)
T = temperature (K)
View plot Requires a JavaScript / HTML 5 canvas capable browser.
Temperature (K) | A | B | C | Reference | Comment |
---|---|---|---|---|---|
396.5 to 594. | 5.29422 | 2972.291 | -32.259 | Stull, 1947 | Coefficents calculated by NIST from author's data. |

Gas phase ion energetics data

Data compiled as indicated in comments:
LLK - Sharon G. Lias, Rhoda D. Levin, and Sherif A. Kafafi

Ionization energy determinations

IE (eV) Method Reference Comment
8.50PECentineo, Fragala, et al., 1978LLK
8.90PECentineo, Fragala, et al., 1978Vertical value; LLK

Van Den Dool and Kratz RI, non-polar column, temperature ramp

View large format table.

Column type Active phase I Reference Comment
CapillarySE-541537.1Shapi and Hesso, 199025. m/0.32 mm/0.15 μm, He, 40. C @ 1. min, 5. K/min, 280. C @ 15. min

References

Parks and Mosher, 1962
Parks, G.S.; Mosher, H.P.,
Heats of combustion and formation of seven organic compounds containing oxygen,
J. Chem. Phys., 1962, 37, 919-920. [all data]
Weast and Grasselli, 1989
CRC Handbook of Data on Organic Compounds, 2nd Editon, Weast,R.C and Grasselli, J.G., ed(s)., CRC Press, Inc., Boca Raton, FL, 1989, 1. [all data]
Roger and McGregor, 1934
Roger, R.; McGregor, A.,
The Action of Grignard reagent on Desyl Chloride. Part I. Aryl Grignard Reagent,
J. Chem. Soc., 1934, 1934, 1850-3. [all data]
Jenkins, 1933
Jenkins, S.S.,
The Grignard Reaction in the Synthesis of Ketones I. A New Method of Preparing Desoxybenzoin,
J. Am. Chem. Soc., 1933, 55, 703-6. [all data]
Stephenson and Malanowski, 1987
Stephenson, Richard M.; Malanowski, Stanislaw,
Handbook of the Thermodynamics of Organic Compounds, 1987, https://doi.org/10.1007/978-94-009-3173-2
. [all data]
Stull, 1947
Stull, Daniel R.,
Vapor Pressure of Pure Substances. Organic and Inorganic Compounds,
Ind. Eng. Chem., 1947, 39, 4, 517-540, https://doi.org/10.1021/ie50448a022
. [all data]