Hexanedioic acid, 2-methyl-5-methylene-, dimethyl ester
- Formula: C10H16O4
- Molecular weight: 200.2316
- IUPAC Standard InChIKey: SUISJNPVANLQPB-UHFFFAOYSA-N
- CAS Registry Number: 4513-62-6
- Chemical structure:
View 3d structure (requires JavaScript / HTML 5) - Other names: Dimethyl ester of 2-methyl-5-methylene-1,6-hexanedioic acid; dimethyl 2-methyl-5-methyleneadipate

Reaction thermochemistry data

Data compiled by: Hussein Y. Afeefy, Joel F. Liebman, and Stephen E. Stein
Individual Reactions
By formula: 2C5H8O2 = C10H16O4
Quantity | Value | Units | Method | Reference | Comment |
---|---|---|---|---|---|
ΔrH° | -26. | kJ/mol | Kin | Stickler and Meyerhoff, 1980 | liquid phase |

References

Stickler and Meyerhoff, 1980
Stickler, M.; Meyerhoff, G.,
Thermal polymerization of methyl methacrylate. 2. Formation of unsaturated dimers,
Makromol. Chem., 1980, 181, 131-147. [all data]