diethylhexylamine

Phase change data

Data compiled by: Thermodynamics Research Center, NIST Boulder Laboratories, Chris Muzny director

Quantity Value Units Method Reference Comment
Tboil452.65KN/AClosson, Napolitano, et al., 1957Uncertainty assigned by TRC = 1. K
Tboil452.65KN/AGol'dfarb and Ibragimova, 1956Uncertainty assigned by TRC = 3. K

In addition to the Thermodynamics Research Center (TRC) data available from this site, much more physical and chemical property data is available from the following TRC products:

References

Closson, Napolitano, et al., 1957
Closson, R.D.; Napolitano, J.P.; Ecke, G.G.; Kolka, A.J., Base-catalyzed alkylation with olefins, J. Org. Chem., 1957, 22, 646. [all data]

Gol'dfarb and Ibragimova, 1956
Gol'dfarb; Ibragimova, Dokl. Akad. Nauk SSSR, 1956, 106, 469. [all data]