2-Propenal, 3-(3,4-dimethoxyphenyl)-
- Formula: C11H12O3
- Molecular weight: 192.2112
- IUPAC Standard InChIKey: KNUFNLWDGZQKKJ-ONEGZZNKSA-N
- CAS Registry Number: 4497-40-9
- Chemical structure:
View 3d structure (requires JavaScript / HTML 5) - Other names: Cinnamaldehyde, 3,4-dimethoxy-; Coniferaldehyde methyl ether; Methylconiferylaldehyde; 3,4-Dimethoxycinnamaldehyde; Coniferyl aldehyde, methyl ether; 3-(3,4-dimethoxyphenyl)-2-propenal

Van Den Dool and Kratz RI, non-polar column, custom temperature program

Column type | Active phase | I | Reference | Comment |
---|---|---|---|---|
Capillary | VF-5MS | 1790.9 | Tret'yakov, 2008 | 30. m/0.25 mm/0.25 μm, He; Program: Multi-step temperature program; T(initial)=60C; T(final)=270C |

Normal alkane RI, non-polar column, temperature ramp

Column type | Active phase | I | Reference | Comment |
---|---|---|---|---|
Capillary | DB-1 | 1720. | Guy and Vernin, 1996 | He, 70. C @ 5. min, 3. K/min; Column length: 30. m; Column diameter: 0.25 mm; Tend: 300. C |

References

Tret'yakov, 2008
Tret'yakov, K.V.,
Retention Data. NIST Mass Spectrometry Data Center., NIST Mass Spectrometry Data Center, 2008. [all data]
Guy and Vernin, 1996
Guy, I.; Vernin, G.,
Minor compounds from Cistus ladaniferus L. essential oil from esterel. 2. Acids and phenols,
J. Essent. Oil Res., 1996, 8, 4, 455-462, https://doi.org/10.1080/10412905.1996.9700666
. [all data]