Benzene, (3-methyl-2-butenyl)-
- Formula: C11H14
- Molecular weight: 146.2289
- IUPAC Standard InChIKey: XGADZHWYGCKKJF-UHFFFAOYSA-N
- CAS Registry Number: 4489-84-3
- Chemical structure:
View 3d structure (requires JavaScript / HTML 5) - Other names: 2-Butene, 3-methyl-1-phenyl-; (3-Methyl-2-butenyl)benzene; 3-Methyl-1-phenyl-2-butene

Phase change data

Data compiled by: Robert L. Brown and Stephen E. Stein
Reduced pressure boiling point
Tboil (K) | Pressure (bar) | Reference |
---|---|---|
372. to 374. | 0.027 | Frinton Laboratories Inc., 1986 |

Lee's RI, non-polar column, custom temperature program

Column type | Active phase | I | Reference | Comment |
---|---|---|---|---|
Capillary | DB-5MS | 201.2 | Aracil, Font, et al., 2005 | Column length: 60. m; Column diameter: 0.25 mm; Program: not specified |

References

Frinton Laboratories Inc., 1986
Frinton Laboratories Inc.,
Catalog Number 11, Frinton Laboratories Inc., Vineland, NJ, 1986, 99. [all data]
Aracil, Font, et al., 2005
Aracil, I.; Font, R.; Conesa, J.A.,
Semivolatile and volatile compounds from the pyrolysis and combustion of polyvinyl chloride,
J. Anal. Appl. Pyrolysis, 2005, 74, 1-2, 465-478, https://doi.org/10.1016/j.jaap.2004.09.008
. [all data]