3a,4,5,6,7,7a-Hexahydro-4,7-methanoindene
- Formula: C10H14
- Molecular weight: 134.2182
- IUPAC Standard InChIKey: HANKSFAYJLDDKP-UHFFFAOYSA-N
- CAS Registry Number: 4488-57-7
- Chemical structure:
View 3d structure (requires JavaScript / HTML 5) - Stereoisomers:
- Other names: Steriochemistry unspecified; 4,7-Methano-1H-indene, 3a,4,5,6,7,7a-hexahydro-; Dihydrodicyclopentadiene; Tricyclo(5.2.1.0(2,6))dec-3-ene; Tricyclo(5.2.1.0(2,6))dec-4-ene; 4,7-Methanoindene, 3a,4,5,6,7,7a-hexahydro-; 3a,4,5,6,7,7a-hexahydro-4,7-methano-1H-indene

Condensed phase thermochemistry data

Data compiled by: Hussein Y. Afeefy, Joel F. Liebman, and Stephen E. Stein
Quantity | Value | Units | Method | Reference | Comment |
---|---|---|---|---|---|
ΔcH°solid | -5912.0 ± 5.9 | kJ/mol | Ccb | Becker and Roth, 1934 | Reanalyzed by Cox and Pilcher, 1970, Original value = -5912.4 kJ/mol; Corresponding ΔfHºsolid = -23.9 kJ/mol (simple calculation by NIST; no Washburn corrections) |

Kovats' RI, non-polar column, isothermal

Column type | Active phase | Temperature (C) | I | Reference | Comment |
---|---|---|---|---|---|
Capillary | SE-30 | 70. | 1050.5 | Tóth, 1983 | N2; Column length: 15. m; Column diameter: 0.25 mm |

Kovats' RI, polar column, isothermal

Column type | Active phase | Temperature (C) | I | Reference | Comment |
---|---|---|---|---|---|
Capillary | PEG-20M | 70. | 1252.7 | Tóth, 1983 | N2; Column length: 30. m; Column diameter: 0.3 mm |

References

Becker and Roth, 1934
Becker, G.; Roth, W.A.,
Verbrennungswarmen einiger cyclischer kohlenwasserstoffe,
Ber., 1934, 67, 627-632. [all data]
Cox and Pilcher, 1970
Cox, J.D.; Pilcher, G.,
Thermochemistry of Organic and Organometallic Compounds, Academic Press, New York, 1970, 1-636. [all data]
Tóth, 1983
Tóth, T.,
Use of capillary gas chromatography in collecting retention and chemical information for the analysis of complex petrochemical mixtures,
J. Chromatogr., 1983, 279, 157-165, https://doi.org/10.1016/S0021-9673(01)93614-3
. [all data]