3-Heptene, 4-methyl-
- Formula: C8H16
- Molecular weight: 112.2126
- IUPAC Standard InChIKey: KKVVJQGDNYIIMN-UHFFFAOYSA-N
- CAS Registry Number: 4485-16-9
- Chemical structure:
View 3d structure (requires JavaScript / HTML 5) - Stereoisomers:
- Other names: 4-Methyl-3-heptene

Phase change data

Data compiled by: Thermodynamics Research Center, NIST Boulder Laboratories, Chris Muzny director
Quantity | Value | Units | Method | Reference | Comment |
---|---|---|---|---|---|
Tboil | 391. ± 5. | K | AVG | N/A | Average of 6 values; Individual data points |

References

No reference data available.