4'-Fluoro-2'-nitroacetanilide
- Formula: C8H7FN2O3
- Molecular weight: 198.1512
- IUPAC Standard InChIKey: UZBZEUCQENVPQB-UHFFFAOYSA-N
- CAS Registry Number: 448-39-5
- Chemical structure:
View 3d structure (requires JavaScript / HTML 5) - Other names: 4-Fluoro-2-nitroacetanilide

Condensed phase thermochemistry data

Data compiled by: Hussein Y. Afeefy, Joel F. Liebman, and Stephen E. Stein
Quantity | Value | Units | Method | Reference | Comment |
---|---|---|---|---|---|
ΔcH°solid | -3917. | kJ/mol | Ccb | Swarts, 1919 | Not corrected for CODATA value of ΔfH |

References

Swarts, 1919
Swarts, F.,
Etudes thermochimiques sur les combinaisons organiques fluorees,
J. Chim. Phys., 1919, 17, 3-70. [all data]