2,2',4,4',6,6'-hexamethyl-1,1'-biphenyl
- Formula: C18H22
- Molecular weight: 238.3673
- IUPAC Standard InChIKey: CWPWAQJHDDRCKP-UHFFFAOYSA-N
- CAS Registry Number: 4482-03-5
- Chemical structure:
View 3d structure (requires JavaScript / HTML 5) - Permanent link for this species. Use this link for bookmarking this species for future reference.

Phase change data

Data compiled by: Thermodynamics Research Center, NIST Boulder Laboratories, Chris Muzny director
Quantity | Value | Units | Method | Reference | Comment |
---|---|---|---|---|---|
Tfus | 374. ± 1. | K | AVG | N/A | Average of 7 values; Individual data points |

References

No reference data available.