Cycloheptaneethanol
- Formula: C9H18O
- Molecular weight: 142.2386
- IUPAC Standard InChIKey: WLPDUJITFJCPFH-UHFFFAOYSA-N
- CAS Registry Number: 4480-98-2
- Chemical structure:
View 3d structure (requires JavaScript / HTML 5) - Permanent link for this species. Use this link for bookmarking this species for future reference.

Condensed phase thermochemistry data

Data compiled by: Hussein Y. Afeefy, Joel F. Liebman, and Stephen E. Stein
Quantity | Value | Units | Method | Reference | Comment |
---|---|---|---|---|---|
ΔcH°liquid | -5661.4 | kJ/mol | Ccb | Zubova, 1901 | Corresponding ΔfHºliquid = -452.7 kJ/mol (simple calculation by NIST; no Washburn corrections) |

References

Zubova, 1901
Zubova, P.,
Data about heat of combustion of compound cycle structure,
Zh. Fiz. Khim., 1901, 33, 708-722. [all data]