α,α,α-Trifluoro-o-tolunitrile
- Formula: C8H4F3N
- Molecular weight: 171.1193
- IUPAC Standard InChIKey: SOZGHDCEWOLLHV-UHFFFAOYSA-N
- CAS Registry Number: 447-60-9
- Chemical structure:
View 3d structure (requires JavaScript / HTML 5) - Other names: o-Trifluoromethylbenzonitrile; 2-Trifluoromethylbenzonitrile; Benzonitrile, 2-(trifluoromethyl)-; o-Tolunitrile, alpha,alpha,alpha-trifluoro-; alpha,alpha,alpha-Trifluoro-o-tolunitrile; α,α,α-trifluoro-2-toluonitrile

Phase change data

Data compiled by: Robert L. Brown and Stephen E. Stein
Quantity | Value | Units | Method | Reference | Comment |
---|---|---|---|---|---|
Tboil | 477. to 479. | K | N/A | PCR Inc., 1990 |

Gas phase ion energetics data

Data compiled by: John E. Bartmess
Electron affinity determinations
EA (eV) | Method | Reference | Comment |
---|---|---|---|
0.70 ± 0.10 | TDEq | Kebarle and Chowdhury, 1987 |

References

PCR Inc., 1990
PCR Inc.,
Research Chemicals Catalog 1990-1991, PCR Inc., Gainesville, FL, 1990, 1. [all data]
Kebarle and Chowdhury, 1987
Kebarle, P.; Chowdhury, S.,
Electron affinities and electron transfer reactions,
Chem. Rev., 1987, 87, 513. [all data]