Malonic acid, tetradecyl-
- Formula: C17H32O4
- Molecular weight: 300.4336
- IUPAC Standard InChIKey: SMTKGALBDOEZCA-UHFFFAOYSA-N
- CAS Registry Number: 4475-23-4
- Chemical structure:
View 3d structure (requires JavaScript / HTML 5) - Permanent link for this species. Use this link for bookmarking this species for future reference.

Condensed phase thermochemistry data

Data compiled by: Hussein Y. Afeefy, Joel F. Liebman, and Stephen E. Stein
Quantity | Value | Units | Method | Reference | Comment |
---|---|---|---|---|---|
ΔcH°solid | -2384.4 ± 1.8 | kcal/mol | Ccb | Verkade and Coops, 1933 | At 288 °K; Corresponding ΔfHºsolid = -307.52 kcal/mol (simple calculation by NIST; no Washburn corrections) |

References

Verkade and Coops, 1933
Verkade, P.E.; Coops, J., Jr.,
Alternation phenomena VI (calorimetric researches XX): alternations in the properties of n.monoalkylmalonic acids. Some remarks on malkins views concerning the alternation phenonema,
Recl. Trav. Chim. Pays-Bas, 1933, 52, 747-767. [all data]