C21H16
- Formula: C21H16
- Molecular weight: 268.3517
- IUPAC Standard InChIKey: UFTDGVXRVMJEDI-UHFFFAOYSA-N
- CAS Registry Number: 4467-88-3
- Chemical structure:
View 3d structure (requires JavaScript / HTML 5) - Species with the same structure:

Reaction thermochemistry data

Data compiled by: John E. Bartmess
Individual Reactions
C21H15- + =
By formula: C21H15- + H+ = C21H16
Quantity | Value | Units | Method | Reference | Comment |
---|---|---|---|---|---|
ΔrH° | 1402. ± 8.8 | kJ/mol | G+TS | Taft and Bordwell, 1988 | gas phase |
Quantity | Value | Units | Method | Reference | Comment |
ΔrG° | 1376. ± 8.4 | kJ/mol | IMRE | Taft and Bordwell, 1988 | gas phase |

Gas phase ion energetics data

Data compiled by: John E. Bartmess
De-protonation reactions
C21H15- + =
By formula: C21H15- + H+ = C21H16
Quantity | Value | Units | Method | Reference | Comment |
---|---|---|---|---|---|
ΔrH° | 1402. ± 8.8 | kJ/mol | G+TS | Taft and Bordwell, 1988 | gas phase |
Quantity | Value | Units | Method | Reference | Comment |
ΔrG° | 1376. ± 8.4 | kJ/mol | IMRE | Taft and Bordwell, 1988 | gas phase |

References

Taft and Bordwell, 1988
Taft, R.W.; Bordwell, F.G.,
Structural and Solvent Effects Evaluated from Acidities Measured in Dimethyl Sulfoxide and in the Gas Phase,
Acc. Chem. Res., 1988, 21, 12, 463, https://doi.org/10.1021/ar00156a005
. [all data]