1-[(2-hydroxyethyl)amino]anthraquinone
- Formula: C16H13NO2
- Molecular weight: 251.2799
- IUPAC Standard InChIKey: DQIHOZJLTDMMSG-UHFFFAOYSA-N
- CAS Registry Number: 4465-58-1
- Chemical structure:
View 3d structure (requires JavaScript / HTML 5) - Other names: 1-(2-Hydroxyethylamino)-9,10-anthraquinone

Phase change data

Data compiled by: William E. Acree, Jr., James S. Chickos
Enthalpy of sublimation
ΔsubH (kJ/mol) | Temperature (K) | Method | Reference | Comment |
---|---|---|---|---|
152.7 | 410. | ME | Bradley, Bird, et al., 1960 | Based on data from 403. to 417. K. See also JONES and KRASKA, 2008. |

References

Bradley, Bird, et al., 1960
Bradley, R.S.; Bird, C.L.; Jones, F.,
The vapour pressures and heats of sublimation of some disperse dyes,
Trans. Faraday Soc., 1960, 56, 23, https://doi.org/10.1039/tf9605600023
. [all data]
JONES and KRASKA, 2008
JONES, F.; KRASKA, J.,
Vapour-phase Dyeing of Synthetic-polymer Fibres,
J Food Science, 2008, 82, 9, 333-338, https://doi.org/10.1111/j.1478-4408.1966.tb02726.x
. [all data]