Benzene, 4-fluoro-2-methyl-1-nitro-
- Formula: C7H6FNO2
- Molecular weight: 155.1264
- IUPAC Standard InChIKey: JHFOWEGCZWLHNW-UHFFFAOYSA-N
- CAS Registry Number: 446-33-3
- Chemical structure:
View 3d structure (requires JavaScript / HTML 5) - Other names: Toluene, 5-fluoro-2-nitro-; 2-Methyl-4-fluoronitrobenzene; 3-Fluoro-6-nitrotoluene; 3-Methyl-4-nitrofluorobenzene; 5-Fluoro-2-nitrotoluene

Phase change data

Data compiled by: Robert L. Brown and Stephen E. Stein
Reduced pressure boiling point
Tboil (K) | Pressure (bar) | Reference |
---|---|---|
370.7 | 0.013 | Weast and Grasselli, 1989 |

Gas phase ion energetics data

Data compiled by: John E. Bartmess
Electron affinity determinations
EA (eV) | Method | Reference | Comment |
---|---|---|---|
1.010 ± 0.048 | IMRE | Fukuda and McIver, 1985 | ΔGea(355 K) = -22.7 kcal/mol; ΔSea =-1.6, est. from data in Chowdhury, Heinis, et al., 1986 |

References

Weast and Grasselli, 1989
CRC Handbook of Data on Organic Compounds, 2nd Editon, Weast,R.C and Grasselli, J.G., ed(s)., CRC Press, Inc., Boca Raton, FL, 1989, 1. [all data]
Fukuda and McIver, 1985
Fukuda, E.K.; McIver, R.T., Jr.,
Relative electron affinities of substituted benzophenones, nitrobenzenes, and quinones. [Anchored to EA(SO2) from 74CEL/BEN],
J. Am. Chem. Soc., 1985, 107, 2291. [all data]
Chowdhury, Heinis, et al., 1986
Chowdhury, S.; Heinis, T.; Grimsrud, E.P.; Kebarle, P.,
Entropy Changes and Electron Affinities from Gas-Phase Electron Transfer Equilibria: A- + B = A + B-,
J. Phys. Chem., 1986, 90, 12, 2747, https://doi.org/10.1021/j100403a037
. [all data]