1-Isopentyl-piperidine
- Formula: C10H21N
- Molecular weight: 155.2804
- IUPAC Standard InChIKey: PWMYYGYCTJRBBX-UHFFFAOYSA-N
- CAS Registry Number: 4462-09-3
- Chemical structure:
View 3d structure (requires JavaScript / HTML 5) - Other names: N-Isopentylpiperidine

Kovats' RI, non-polar column, isothermal

Column type | Active phase | Temperature (C) | I | Reference | Comment |
---|---|---|---|---|---|
Capillary | OV-101 | 110. | 1084. | Zhuravleva, 2000 | 50. m/0.3 mm/0.4 μm, He |

Normal alkane RI, non-polar column, custom temperature program

Column type | Active phase | I | Reference | Comment |
---|---|---|---|---|
Capillary | Methyl Silicone | 1080. | Farkas, Héberger, et al., 2004 | Program: not specified |

References

Zhuravleva, 2000
Zhuravleva, I.L.,
Evaluation of the polarity and boiling points of nitrogen-containing heterocyclic compounds by gas chromatography,
Russ. Chem. Bull. (Engl. Transl.), 2000, 49, 2, 325-328, https://doi.org/10.1007/BF02494682
. [all data]
Farkas, Héberger, et al., 2004
Farkas, O.; Héberger, K.; Zenkevich, I.G.,
Quantitative structure-retention relationships. XIV. Prediction of gas chromatographic retention indices for saturated O-, N-, and S-heterocyclic compounds,
Chemom. Intell. Lab. Syst., 2004, 72, 2, 173-184, https://doi.org/10.1016/j.chemolab.2004.01.012
. [all data]