Butane, 1,1-dimethoxy
- Formula: C6H14O2
- Molecular weight: 118.1742
- IUPAC Standard InChIKey: DZKUKLGGGNLHNY-UHFFFAOYSA-N
- CAS Registry Number: 4461-87-4
- Chemical structure:
View 3d structure (requires JavaScript / HTML 5) - Species with the same structure:
- Other names: Butanal dimethyl acetal

Gas phase thermochemistry data

Data compiled by: Hussein Y. Afeefy, Joel F. Liebman, and Stephen E. Stein
Quantity | Value | Units | Method | Reference | Comment |
---|---|---|---|---|---|
ΔfH°gas | -426. ± 2. | kJ/mol | Cm | Wiberg, Morgan, et al., 1994 |

Condensed phase thermochemistry data

Data compiled by: Hussein Y. Afeefy, Joel F. Liebman, and Stephen E. Stein
Quantity | Value | Units | Method | Reference | Comment |
---|---|---|---|---|---|
ΔfH°liquid | -467.4 ± 0.8 | kJ/mol | Cm | Wiberg, Morgan, et al., 1994 |

Phase change data

Data compiled as indicated in comments:
TRC - Thermodynamics Research Center, NIST Boulder Laboratories, Chris Muzny director
ALS - Hussein Y. Afeefy, Joel F. Liebman, and Stephen E. Stein
DRB - Donald R. Burgess, Jr.
AC - William E. Acree, Jr., James S. Chickos
Quantity | Value | Units | Method | Reference | Comment |
---|---|---|---|---|---|
Tboil | 387. | K | N/A | Adams and Adkins, 1925 | Uncertainty assigned by TRC = 4. K; TRC |
Quantity | Value | Units | Method | Reference | Comment |
ΔvapH° | 41.7 | kJ/mol | V | Wiberg, Morgan, et al., 1994 | ALS |
ΔvapH° | 41.4 | kJ/mol | N/A | Wiberg, Morgan, et al., 1994 | DRB |
Enthalpy of vaporization
ΔvapH (kJ/mol) | Temperature (K) | Method | Reference | Comment |
---|---|---|---|---|
41.2 | 317. | EB | Wiberg, Morgan, et al., 1994 | Based on data from 304. to 329. K.; AC |

Reaction thermochemistry data

Data compiled by: Hussein Y. Afeefy, Joel F. Liebman, and Stephen E. Stein
Individual Reactions
By formula: C6H14O2 + H2O = C4H8O + 2CH4O
Quantity | Value | Units | Method | Reference | Comment |
---|---|---|---|---|---|
ΔrH° | 36.2 ± 0.1 | kJ/mol | Cm | Wiberg, Morgan, et al., 1994 | liquid phase |
ΔrH° | 36.53 ± 0.096 | kJ/mol | Eqk | Wiberg and Squires, 1981 | liquid phase |
By formula: C4H8O + 2CH4O = C6H14O2 + H2O
Quantity | Value | Units | Method | Reference | Comment |
---|---|---|---|---|---|
ΔrH° | -59. ± 1. | kJ/mol | Cm | Wiberg, Morgan, et al., 1994 | gas phase |

References

Wiberg, Morgan, et al., 1994
Wiberg, K.B.; Morgan, K.M.; Maltz, H.,
Thermochemistry of carbonyl reactions. 6. A study of hydration equilibria,
J. Am. Chem. Soc., 1994, 116, 11067-11077. [all data]
Adams and Adkins, 1925
Adams, E.W.; Adkins, H.,
Catalysis in Acetal Formation,
J. Am. Chem. Soc., 1925, 47, 1358-67. [all data]
Wiberg and Squires, 1981
Wiberg, K.B.; Squires, R.R.,
Thermochemical studies of carbonyl reactions. 2. Steric effects in acetal and ketal hydrolysis,
J. Am. Chem. Soc., 1981, 103, 4473-4478. [all data]