2-Butene, 2-chloro-
- Formula: C4H7Cl
- Molecular weight: 90.551
- IUPAC Standard InChIKey: DSDHFHLZEFQSFM-UHFFFAOYSA-N
- CAS Registry Number: 4461-41-0
- Chemical structure:
View 3d structure (requires JavaScript / HTML 5) - Stereoisomers:
- Other names: 2-Chloro-2-butene; 2-Chloro-2-butene(cis-trans); 2-chlorobut-2-ene

Phase change data

Data compiled by: Robert L. Brown and Stephen E. Stein
Quantity | Value | Units | Method | Reference | Comment |
---|---|---|---|---|---|
Tboil | 337.7 | K | N/A | Aldrich Chemical Company Inc., 1990 |

Reaction thermochemistry data

Data compiled by: Hussein Y. Afeefy, Joel F. Liebman, and Stephen E. Stein
Individual Reactions
By formula: C4H8Cl2 = C4H7Cl + HCl
Quantity | Value | Units | Method | Reference | Comment |
---|---|---|---|---|---|
ΔrH° | 65.3 ± 0.84 | kJ/mol | Eqk | Rodova, Levanova, et al., 1973 | gas phase; At 454 K |

References

Aldrich Chemical Company Inc., 1990
Aldrich Chemical Company Inc.,
Catalog Handbook of Fine Chemicals, Aldrich Chemical Company, Inc., Milwaukee WI, 1990, 1. [all data]
Rodova, Levanova, et al., 1973
Rodova, R.M.; Levanova, S.V.; Shevtsova, L.A.; Rozhnov, A.M.; Porfir'eva, E.I.,
Reversible reactions of 2,3-dichlorobutane,
Russ. J. Phys. Chem. (Engl. Transl.), 1973, 47, 607. [all data]