Cyclopentane, hexyl-
- Formula: C11H22
- Molecular weight: 154.2924
- IUPAC Standard InChIKey: LKHGKBBAJAFMSQ-UHFFFAOYSA-N
- CAS Registry Number: 4457-00-5
- Chemical structure:
View 3d structure (requires JavaScript / HTML 5) - Other names: Hexylcyclopentane

Gas phase thermochemistry data

Data compiled by: Hussein Y. Afeefy, Joel F. Liebman, and Stephen E. Stein
Quantity | Value | Units | Method | Reference | Comment |
---|---|---|---|---|---|
ΔfH°gas | -209.5 ± 1.6 | kJ/mol | Ccb | Prosen, Johnson, et al., 1946 | Heat of combustion of the gas |

Condensed phase thermochemistry data

Data compiled by: Hussein Y. Afeefy, Joel F. Liebman, and Stephen E. Stein
Quantity | Value | Units | Method | Reference | Comment |
---|---|---|---|---|---|
ΔcH°liquid | -7263.4 ± 1.5 | kJ/mol | Ccb | Prosen, Johnson, et al., 1946 | Heat of combustion of the gas; Corresponding ΔfHºliquid = -209.4 kJ/mol (simple calculation by NIST; no Washburn corrections) |

Phase change data

Data compiled by: William E. Acree, Jr., James S. Chickos
Quantity | Value | Units | Method | Reference | Comment |
---|---|---|---|---|---|
ΔvapH° | 55.9 | kJ/mol | N/A | Reid, 1972 |

Gas phase ion energetics data

Data compiled by: Sharon G. Lias, Rhoda D. Levin, and Sherif A. Kafafi
Ionization energy determinations
IE (eV) | Method | Reference |
---|---|---|
9.90 ± 0.03 | PE | Rang, Paldoia, et al., 1974 |

Kovats' RI, non-polar column, isothermal

Column type | Active phase | Temperature (C) | I | Reference | Comment |
---|---|---|---|---|---|
Capillary | OV-1 | 100. | 1137.9 | Anders, Anders, et al., 1985 | 55. m/0.21 mm/0.35 μm, N2 |
Packed | Squalane | 100. | 1137. | Bogoslovsky, Anvaer, et al., 1978 | |
Packed | Squalane | 120. | 1141. | Bogoslovsky, Anvaer, et al., 1978 | |
Packed | Squalane | 80. | 1133. | Bogoslovsky, Anvaer, et al., 1978 | |
Capillary | Squalane | 100. | 1135. | Rang, Orav, et al., 1977 | Nitrogen or helium; Column length: 100. m; Column diameter: 0.25 mm |
Capillary | Squalane | 100. | 1138. | Dielmann, Schwengers, et al., 1974 | Column length: 100. m; Column diameter: 0.25 mm |
Capillary | Squalane | 120. | 1141. | Dielmann, Schwengers, et al., 1974 | Column length: 100. m; Column diameter: 0.25 mm |
Capillary | Squalane | 80. | 1133. | Dielmann, Schwengers, et al., 1974 | Column length: 100. m; Column diameter: 0.25 mm |

Kovats' RI, polar column, isothermal

Column type | Active phase | Temperature (C) | I | Reference | Comment |
---|---|---|---|---|---|
Capillary | PEG 4000 | 100. | 1207. | Rang, Orav, et al., 1988 | |
Capillary | PEG 4000 | 70. | 1194. | Rang, Orav, et al., 1988 | |
Capillary | PEG 4000 | 80. | 1199. | Rang, Orav, et al., 1988 | |
Capillary | PEG-20M | 100. | 1196. | Rang, Orav, et al., 1988 | |
Capillary | PEG-20M | 110. | 1200. | Rang, Orav, et al., 1988 | |
Capillary | PEG-20M | 120. | 1204. | Rang, Orav, et al., 1988 | |
Capillary | PEG-20M | 130. | 1208. | Rang, Orav, et al., 1988 | |
Capillary | PEG-20M | 140. | 1212. | Rang, Orav, et al., 1988 | |
Capillary | PEG-20M | 80. | 1188. | Rang, Orav, et al., 1988 | |
Capillary | PEG-20M | 90. | 1192. | Rang, Orav, et al., 1988 | |
Capillary | PEG-20M | 100. | 1196.2 | Orav, Kuningas, et al., 1982 | He; Column length: 100. m; Column diameter: 0.25 mm |
Capillary | PEG-20M | 110. | 1199.7 | Orav, Kuningas, et al., 1982 | He; Column length: 100. m; Column diameter: 0.25 mm |
Capillary | PEG-20M | 120. | 1204.4 | Orav, Kuningas, et al., 1982 | He; Column length: 100. m; Column diameter: 0.25 mm |
Capillary | PEG-20M | 130. | 1208.5 | Orav, Kuningas, et al., 1982 | He; Column length: 100. m; Column diameter: 0.25 mm |
Capillary | PEG-20M | 140. | 1212.4 | Orav, Kuningas, et al., 1982 | He; Column length: 100. m; Column diameter: 0.25 mm |
Capillary | PEG-20M | 80. | 1187.5 | Orav, Kuningas, et al., 1982 | He; Column length: 100. m; Column diameter: 0.25 mm |
Capillary | PEG-20M | 90. | 1192. | Orav, Kuningas, et al., 1982 | He; Column length: 100. m; Column diameter: 0.25 mm |
Capillary | PEG 4000 | 100. | 1207. | Rang, Orav, et al., 1977 | Nitrogen or Helium; Column length: 45. m; Column diameter: 0.25 mm |

Van Den Dool and Kratz RI, non-polar column, temperature ramp

Column type | Active phase | I | Reference | Comment |
---|---|---|---|---|
Capillary | Petrocol DH | 1136. | White, Hackett, et al., 1992 | 100. m/0.25 mm/0.5 μm, He, 1. K/min; Tstart: 30. C; Tend: 220. C |

Normal alkane RI, non-polar column, temperature ramp

Column type | Active phase | I | Reference | Comment |
---|---|---|---|---|
Capillary | HP-5 MS | 1136. | Kotowska, Zalikowski, et al., 2012 | 30. m/0.25 mm/0.25 μm, Helium, 35. C @ 5. min, 3. K/min, 300. C @ 15. min |
Capillary | SP-2100 | 1132. | Alencar, Alves, et al., 1983 | He, 4. K/min; Column length: 30. m; Column diameter: 0.25 mm; Tstart: 40. C; Tend: 250. C |

Normal alkane RI, non-polar column, custom temperature program

Column type | Active phase | I | Reference | Comment |
---|---|---|---|---|
Capillary | HP-5 MS | 1134. | Kotowska, Zalikowski, et al., 2012 | 30. m/0.25 mm/0.25 μm, Helium; Program: not specified |
Capillary | Squalane | 1134. | Chen, 2008 | Program: not specified |

References

Prosen, Johnson, et al., 1946
Prosen, E.J.; Johnson, W.H.; Rossini, F.D.,
Heats of formation and combustion of the normal alkylcyclopentanes and cyclohexanes and the increment per CH2 group for several homologous series of hydrocarbons,
J. Res. NBS, 1946, 37, 51-56. [all data]
Reid, 1972
Reid, Robert C.,
Handbook on vapor pressure and heats of vaporization of hydrocarbons and related compounds, R. C. Wilhort and B. J. Zwolinski, Texas A Research Foundation. College Station, Texas(1971). 329 pages.$10.00,
AIChE J., 1972, 18, 6, 1278-1278, https://doi.org/10.1002/aic.690180637
. [all data]