Benzoic acid, 2-fluoro-
- Formula: C7H5FO2
- Molecular weight: 140.1118
- IUPAC Standard InChIKey: NSTREUWFTAOOKS-UHFFFAOYSA-N
- CAS Registry Number: 445-29-4
- Chemical structure:
View 3d structure (requires JavaScript / HTML 5) - Other names: Benzoic acid, o-fluoro-; o-Fluorobenzoic acid; 2-Fluorobenzoic acid; ortho-Fluorobenzoic acid; o-Fluorbenzoesaeure

Condensed phase thermochemistry data

Data compiled by: Hussein Y. Afeefy, Joel F. Liebman, and Stephen E. Stein
Quantity | Value | Units | Method | Reference | Comment |
---|---|---|---|---|---|
ΔfH°solid | -568.5 ± 1.1 | kJ/mol | Ccr | Johnson and Prosen, 1975 | |
ΔfH°solid | -567.6 ± 1.9 | kJ/mol | Ccr | Good, Scott, et al., 1956 | Corrected for CODATA value of ΔfH |
Quantity | Value | Units | Method | Reference | Comment |
ΔcH°solid | -3080.0 ± 1.0 | kJ/mol | Ccr | Johnson and Prosen, 1975 | |
ΔcH°solid | -3080.6 ± 1.5 | kJ/mol | Ccr | Good, Scott, et al., 1956 | Corrected for CODATA value of ΔfH |
ΔcH°solid | -3097. | kJ/mol | Ccb | Swarts, 1919 | Not corrected for CODATA value of ΔfH |

Phase change data

Data compiled by: William E. Acree, Jr., James S. Chickos
Quantity | Value | Units | Method | Reference | Comment |
---|---|---|---|---|---|
ΔsubH° | 94.4 ± 0.8 | kJ/mol | N/A | Monte and Hillesheim, 2000 |
Enthalpy of sublimation
ΔsubH (kJ/mol) | Temperature (K) | Method | Reference | Comment |
---|---|---|---|---|
93.9 ± 0.5 | 316. | ME | Monte and Hillesheim, 2000 | Based on data from 309. to 323. K. |

Reaction thermochemistry data

Data compiled by: John E. Bartmess
Individual Reactions
C7H4FO2- + =
By formula: C7H4FO2- + H+ = C7H5FO2
Quantity | Value | Units | Method | Reference | Comment |
---|---|---|---|---|---|
ΔrH° | 1414. ± 9.2 | kJ/mol | G+TS | Kebarle and McMahon, 1977 | gas phase |
Quantity | Value | Units | Method | Reference | Comment |
ΔrG° | 1383. ± 8.4 | kJ/mol | IMRE | Kebarle and McMahon, 1977 | gas phase |

Gas phase ion energetics data

Data compiled by: John E. Bartmess
De-protonation reactions
C7H4FO2- + =
By formula: C7H4FO2- + H+ = C7H5FO2
Quantity | Value | Units | Method | Reference | Comment |
---|---|---|---|---|---|
ΔrH° | 1414. ± 9.2 | kJ/mol | G+TS | Kebarle and McMahon, 1977 | gas phase |
Quantity | Value | Units | Method | Reference | Comment |
ΔrG° | 1383. ± 8.4 | kJ/mol | IMRE | Kebarle and McMahon, 1977 | gas phase |

References

Johnson and Prosen, 1975
Johnson, W.H.; Prosen, E.J.,
Enthalpies of combustion and formation of ortho- and parafluorobenzoic acid,
J. Res. Natl. Bur. Stand. Sect. A:, 1975, 79, 481-486. [all data]
Good, Scott, et al., 1956
Good, W.D.; Scott, D.W.; Waddington, G.,
Combustion calorimetry of organic fluorine compounds by a rotating-bomb method,
J. Phys. Chem., 1956, 60, 1080-1089. [all data]
Swarts, 1919
Swarts, F.,
Etudes thermochimiques sur les combinaisons organiques fluorees,
J. Chim. Phys., 1919, 17, 3-70. [all data]
Monte and Hillesheim, 2000
Monte, Manuel J.S.; Hillesheim, Dorothea M.,
Thermodynamic study on the sublimation of the three iodobenzoic acids and of 2-fluoro- and 3-fluorobenzoic acids,
The Journal of Chemical Thermodynamics, 2000, 32, 12, 1727-1735, https://doi.org/10.1006/jcht.2000.0705
. [all data]
Kebarle and McMahon, 1977
Kebarle, P.; McMahon, T.B.,
Intrinsic Acidities of Substituted Phenols and Benzoic Acids Determined by Gas Phase Proton Transfer Equilibria,
J. Am. Chem. Soc., 1977, 99, 7, 2222, https://doi.org/10.1021/ja00449a032
. [all data]