[(1R)-1-[(1S)-1-methylpropoxy]ethyl]-, rel-

Phase change data

Data compiled by: William E. Acree, Jr., James S. Chickos

Quantity Value Units Method Reference Comment
Δvap58.7 ± 0.5kJ/molGSKrasnykh, Vasiltsova, et al., 2002Based on data from 296. - 332. K. See also Verevkin and Heintz, 2002.

References

Krasnykh, Vasiltsova, et al., 2002
Krasnykh, Eugen L.; Vasiltsova, Tatiana V.; Verevkin, Sergey P.; Heintz, Andreas, Vapor Pressures and Enthalpies of Vaporization of Benzyl Halides and Benzyl Ethers, J. Chem. Eng. Data, 2002, 47, 6, 1372-1378, https://doi.org/10.1021/je020034h . [all data]

Verevkin and Heintz, 2002
Verevkin, Sergey P.; Heintz, Andreas, Chemical equilibrium study in the reacting system of (1-alkoxyethyl)benzene synthesis from isoalkanols and styreneElectronic supplementary information (ESI) available: experimentally determined compositions of equilibrium mixtures in the reactions of alkanols with styrene; results of combustion experiments. See http://www.rsc.org/suppdata/p2/b2/b200312k/, J. Chem. Soc., Perkin Trans. 2, 2002, 4, 728-733, https://doi.org/10.1039/b200312k . [all data]