Benzenamine, 4-chloro-2-(trifluoromethyl)-
- Formula: C7H5ClF3N
- Molecular weight: 195.570
- IUPAC Standard InChIKey: CVINWVPRKDIGLL-UHFFFAOYSA-N
- CAS Registry Number: 445-03-4
- Chemical structure:
View 3d structure (requires JavaScript / HTML 5) - Other names: o-Toluidine, 4-chloro-α,α,α-trifluoro-; C.I. Azoic Diazo Component 17; C.I. 37055; Diazo Fast Scarlet VD; Fast Scarlet Salt VD; Fast Scarlet VD Salt; Scarlet Salt NVD; 4-Chloro-2-(trifluoromethyl)aniline; 2-Amino-5-chlorobenzotrifluoride; 5-Chloro-2-aminobenzotrifluoride; 2-Trifluoromethyl-4-chloroaniline; 4-Chloro-α,α,α-trifluoro-o-toluidine; 5-Chloro-2-aminotrifluorotoluene

Phase change data

Data compiled by: Robert L. Brown and Stephen E. Stein
Reduced pressure boiling point
Tboil (K) | Pressure (bar) | Reference |
---|---|---|
339.7 | 0.004 | Aldrich Chemical Company Inc., 1990 |
349. to 351. | 0.0045 | PCR Inc., 1990 |
360. to 361. | 0.013 | Frinton Laboratories Inc., 1986 |

References

Aldrich Chemical Company Inc., 1990
Aldrich Chemical Company Inc.,
Catalog Handbook of Fine Chemicals, Aldrich Chemical Company, Inc., Milwaukee WI, 1990, 1. [all data]
PCR Inc., 1990
PCR Inc.,
Research Chemicals Catalog 1990-1991, PCR Inc., Gainesville, FL, 1990, 1. [all data]
Frinton Laboratories Inc., 1986
Frinton Laboratories Inc.,
Catalog Number 11, Frinton Laboratories Inc., Vineland, NJ, 1986, 99. [all data]