Cycloheptaneethylamine
- Formula: C9H19N
- Molecular weight: 141.2539
- IUPAC Standard InChIKey: TVNJOEXFIFMSSH-UHFFFAOYSA-N
- CAS Registry Number: 4448-84-4
- Chemical structure:
View 3d structure (requires JavaScript / HTML 5) - Permanent link for this species. Use this link for bookmarking this species for future reference.

Condensed phase thermochemistry data

Data compiled by: Hussein Y. Afeefy, Joel F. Liebman, and Stephen E. Stein
Quantity | Value | Units | Method | Reference | Comment |
---|---|---|---|---|---|
ΔcH°liquid | -6024.1 | kJ/mol | Ccb | Zubova, 1901 |

References

Zubova, 1901
Zubova, P.,
Data about heat of combustion of compound cycle structure,
Zh. Fiz. Khim., 1901, 33, 708-722. [all data]