Benzene, octadecyl-
- Formula: C24H42
- Molecular weight: 330.5903
- IUPAC Standard InChIKey: WSVDSBZMYJJMSB-UHFFFAOYSA-N
- CAS Registry Number: 4445-07-2
- Chemical structure:
View 3d structure (requires JavaScript / HTML 5) - Other names: Octadecane, 1-phenyl-; Octadecylbenzene; 1-Phenyloctadecane; n-Octadecylbenzene; 2-Phenyloctadecane

Phase change data

Data compiled as indicated in comments:
TRC - Thermodynamics Research Center, NIST Boulder Laboratories, Chris Muzny director
AC - William E. Acree, Jr., James S. Chickos
Quantity | Value | Units | Method | Reference | Comment |
---|---|---|---|---|---|
Tfus | 307. ± 6. | K | AVG | N/A | Average of 12 values; Individual data points |
Enthalpy of vaporization
ΔvapH (kJ/mol) | Temperature (K) | Reference | Comment |
---|---|---|---|
101. | 438. | Dykyj, Svoboda, et al., 1999 | Based on data from 423. to 675. K.; AC |

References

Dykyj, Svoboda, et al., 1999
Dykyj, J.; Svoboda, J.; Wilhoit, R.C.; Frenkel, M.L.; Hall, K.R.,
Vapor Pressure of Chemicals: Part A. Vapor Pressure and Antoine Constants for Hydrocarbons and Sulfur, Selenium, Tellurium and Hydrogen Containing Organic Compounds, Springer, Berlin, 1999, 373. [all data]