Cyclohexane, octadecyl-
- Formula: C24H48
- Molecular weight: 336.6379
- IUPAC Standard InChIKey: MWWVNZNVTGBKQO-UHFFFAOYSA-N
- CAS Registry Number: 4445-06-1
- Chemical structure:

Phase change data

Data compiled as indicated in comments:
TRC - Thermodynamics Research Center, NIST Boulder Laboratories, Chris Muzny director
AC - William E. Acree, Jr., James S. Chickos
Quantity | Value | Units | Method | Reference | Comment |
---|---|---|---|---|---|
Tfus | 314.8 | K | N/A | Boelhouwer, Nederbragt, et al., 1950 | Uncertainty assigned by TRC = 0.5 K; TRC |
Tfus | 314.7 | K | N/A | Mazee, 1948 | Uncertainty assigned by TRC = 0.1 K; TRC |
Tfus | 314.15 | K | N/A | Hetling and Shchekin, 1943 | Uncertainty assigned by TRC = 2. K; TRC |
Tfus | 316.4 | K | N/A | Larsen, Thorpe, et al., 1942 | Uncertainty assigned by TRC = 2. K; TRC |
Enthalpy of vaporization
ΔvapH (kcal/mol) | Temperature (K) | Reference | Comment |
---|---|---|---|
23.97 | 437. | Dykyj, Svoboda, et al., 1999 | Based on data from 422. to 675. K.; AC |

Kovats' RI, non-polar column, isothermal

View large format table.

Column type Active phase Temperature (C) I Reference Comment
CapillaryOV-101210.2473.Kusmierz, Malinski, et al., 1985Column length: 22. m; Column diameter: 0.3 mm
CapillaryApiezon L190.2486.7Kusmierz, Malinski, et al., 1985He; Column length: 20. m; Column diameter: 0.3 mm
CapillarySE-52210.2481.1Kusmierz, Malinski, et al., 1985He; Column length: 40. m; Column diameter: 0.3 mm

Kovats' RI, non-polar column, custom temperature program

View large format table.

Column type Active phase I Reference Comment
CapillaryHP-5MS2486.Kenig, Simons, et al., 200530. m/0.25 mm/0.25 μm, He; Program: 60C(1.5min) => 20C/min => 130C => 4C/min => 315C (90min)

Kovats' RI, polar column, isothermal

View large format table.

Column type Active phase Temperature (C) I Reference Comment
CapillaryCarbowax 20M170.2502.4Kusmierz, Malinski, et al., 1985He; Column length: 30. m; Column diameter: 0.25 mm

References

Boelhouwer, Nederbragt, et al., 1950
Boelhouwer, J.W.M.; Nederbragt, G.W.; Verberg, G.W.,
Viscosity data of organic liquids,
Appl. Sci. Res., Sect. A, 1950, 2, 249. [all data]
Mazee, 1948
Mazee, W.M.,
Some properties of hydrocarbons having more than twenty carbon atoms,
Recl. Trav. Chim. Pays-Bas, 1948, 67, 197-213. [all data]
Hetling and Shchekin, 1943
Hetling, V.A.; Shchekin, V.V.,
Preparation of Certain High Molecular Hydrocarbons,
Zh. Obshch. Khim., 1943, 13, 717. [all data]
Larsen, Thorpe, et al., 1942
Larsen, R.G.; Thorpe, R.E.; Armfield, F.A.,
Oxidation Characteristics of Pure Hydrocarbons,
Ind. Eng. Chem., 1942, 34, 183. [all data]
Dykyj, Svoboda, et al., 1999
Dykyj, J.; Svoboda, J.; Wilhoit, R.C.; Frenkel, M.L.; Hall, K.R.,
Vapor Pressure of Chemicals: Part A. Vapor Pressure and Antoine Constants for Hydrocarbons and Sulfur, Selenium, Tellurium and Hydrogen Containing Organic Compounds, Springer, Berlin, 1999, 373. [all data]