Eicosane, 9-cyclohexyl-
- Formula: C26H52
- Molecular weight: 364.6911
- IUPAC Standard InChIKey: HFHMPSMIEOIWQO-UHFFFAOYSA-N
- CAS Registry Number: 4443-61-2
- Chemical structure:
View 3d structure (requires JavaScript / HTML 5) - Other names: 9-Cyclohexyleicosane; Cyclohexane, (1-octyldodecyl)-

Condensed phase thermochemistry data

Data compiled by: Hussein Y. Afeefy, Joel F. Liebman, and Stephen E. Stein
Quantity | Value | Units | Method | Reference | Comment |
---|---|---|---|---|---|
ΔfH°liquid | -674.1 ± 6.7 | kJ/mol | Ccb | Knowlton and Huffman, 1944 | Reanalyzed by Cox and Pilcher, 1970, Original value = -675.7 kJ/mol |
Quantity | Value | Units | Method | Reference | Comment |
ΔcH°liquid | -16988.7 ± 6.7 | kJ/mol | Ccb | Knowlton and Huffman, 1944 | Reanalyzed by Cox and Pilcher, 1970, Original value = -16987. kJ/mol; Corresponding ΔfHºliquid = -674.13 kJ/mol (simple calculation by NIST; no Washburn corrections) |

Phase change data

Data compiled as indicated in comments:
TRC - Thermodynamics Research Center, NIST Boulder Laboratories, Chris Muzny director
AC - William E. Acree, Jr., James S. Chickos
Quantity | Value | Units | Method | Reference | Comment |
---|---|---|---|---|---|
Tfus | 314. | K | N/A | Studt, 1966 | Uncertainty assigned by TRC = 1. K; TRC |
Enthalpy of vaporization
ΔvapH (kJ/mol) | Temperature (K) | Method | Reference | Comment |
---|---|---|---|---|
93.6 | 501. | A,MG | Stephenson and Malanowski, 1987 | Based on data from 486. to 523. K. See also Schiessler and Whitmore, 1955.; AC |

References

Knowlton and Huffman, 1944
Knowlton, J.W.; Huffman, H.M.,
The heats of combustion of some substituted eicosanes, heneicosanes and docosanes,
J. Am. Chem. Soc., 1944, 66, 1492-1494. [all data]
Cox and Pilcher, 1970
Cox, J.D.; Pilcher, G.,
Thermochemistry of Organic and Organometallic Compounds, Academic Press, New York, 1970, 1-636. [all data]
Studt, 1966
Studt, P.,
Justus Liebigs Ann. Chem., 1966, 693, 90. [all data]
Stephenson and Malanowski, 1987
Stephenson, Richard M.; Malanowski, Stanislaw,
Handbook of the Thermodynamics of Organic Compounds, 1987, https://doi.org/10.1007/978-94-009-3173-2
. [all data]
Schiessler and Whitmore, 1955
Schiessler, R.W.; Whitmore, F.C.,
Properties of High Molecular Weight Hydrocarbons,
Ind. Eng. Chem., 1955, 47, 8, 1660-1665, https://doi.org/10.1021/ie50548a054
. [all data]