Cyclohexane, (1-butylhexadecyl)-
- Formula: C26H52
- Molecular weight: 364.6911
- IUPAC Standard InChIKey: MBXKQVDZISXAHH-UHFFFAOYSA-N
- CAS Registry Number: 4443-59-8
- Chemical structure:
View 3d structure (requires JavaScript / HTML 5) - Other names: Eicosane, 5-cyclohexyl-; 5-Cyclohexyleicosane

Phase change data

Data compiled as indicated in comments:
TRC - Thermodynamics Research Center, NIST Boulder Laboratories, Chris Muzny director
AC - William E. Acree, Jr., James S. Chickos
Quantity | Value | Units | Method | Reference | Comment |
---|---|---|---|---|---|
Tfus | 270.95 | K | N/A | Anonymous, 1968 | Uncertainty assigned by TRC = 0.5 K; TRC |
Tfus | 264. | K | N/A | Petrov and Chel'tsova, 1942 | Uncertainty assigned by TRC = 4. K; TRC |
Tfus | 264. | K | N/A | Petrov, 1941 | Uncertainty assigned by TRC = 4. K; TRC |
Enthalpy of vaporization
ΔvapH (kJ/mol) | Temperature (K) | Method | Reference | Comment |
---|---|---|---|---|
98.3 | 503. | A,MG | Stephenson and Malanowski, 1987 | Based on data from 488. to 524. K. See also Schiessler and Whitmore, 1955.; AC |

References

Anonymous, 1968
Anonymous, R.,
Properties of hydrocarbon of high molecular weight, Am. Pet. Inst. Res. Proj. 42, Penn. State Univ., 1968. [all data]
Petrov and Chel'tsova, 1942
Petrov, A.D.; Chel'tsova, M.A.,
Synthesis and Properties of Hydrocarbons of the Aromatic and Naphthenic Series of the Composition C19-C26. II.,
J. Gen. Chem. USSR (Engl. Transl.), 1942, 12, 87-94. [all data]
Petrov, 1941
Petrov, A.D.,
Izv. Akad. Nauk SSSR, 1941, 1941, 533. [all data]
Stephenson and Malanowski, 1987
Stephenson, Richard M.; Malanowski, Stanislaw,
Handbook of the Thermodynamics of Organic Compounds, 1987, https://doi.org/10.1007/978-94-009-3173-2
. [all data]
Schiessler and Whitmore, 1955
Schiessler, R.W.; Whitmore, F.C.,
Properties of High Molecular Weight Hydrocarbons,
Ind. Eng. Chem., 1955, 47, 8, 1660-1665, https://doi.org/10.1021/ie50548a054
. [all data]